##TITLE= Raman spectrum of Quartz � http://rdrs.uaic.ro
##MINERAL= Quartz
##CHEMISTRY= SiO2
##JCAMP-DX= 5.01
##DATA TYPE= RAMAN SPECTRUM
##DATA CLASS= XYDATA
##ORIGIN= Department of Geology, UAIC, Romania
##OWNER= http://rdrs.uaic.ro � stud. Apopei Andrei Ionut
##LONGDATE= 2010/03/01 20:43:41.0419 +0200 $$ export date from JSpecView
##XUNITS= Raman shift (1/cm)
##YUNITS= Intensity (cnt)
##XFACTOR= 3.188736E-3
##YFACTOR= 2.93401058E-3
##FIRSTX= 3399.97
##FIRSTY= -0.19513825
##LASTX= 211.234
##NPOINTS= 1024
##XYDATA= (X++(Y..Y))
$$ plain form
1066244 -67 1288 1440 1387 1665 2945 2876 3405 3070 2660 2808 2792 3056 2487 3242 2789 1485 2182 2093 2608 2961 2765
1049171 2438 2250 2561 2217 3029 3185 3258 3184 2622 2042 1896 2870 2818 2925 1704 1409 1692 2648 2176 1785 1626 1742
1031939 1569 2304 2881 2941 3443 3105 3197 3121 2213 1798 2312 3503 3887 3736 3365 3465 3394 3092 2956 2896 3276 3221
1014540 2881 3154 1798 1367 1499 2067 1829 2176 3204 2279 2636 1791 3600 1849 2017 2556 2667 2184 1139 2553
998577 2507 2255 2461 3504 2218 1325 964 2174 2696 2514 2088 1000 1719 952 1910 1866 2587 2466 2693 3190
982480 3422 2496 1617 883 1258 765 830 1965 1535 2328 2186 1687 1656 1382 1820 2090 2009 2535 2338 3160 2637 2672
964611 1137 1527 1842 2292 2075 1433 1691 2182 1807 2250 2496 2855 2442 1778 1198 1909 2157 1802 2147 2364 2143
947391 2047 1306 1335 1056 1746 2041 3412 2943 2611 1932 1092 338 180 1660 1424 1298 1196 1749 820 -109 228
$$ packed form
1066244f7J355J52n3K78J280o9N29l35m10J48j6K64n69P55m53j304O97q9N15L53B765
1049171B438j88L11l44Q12J56P3p4n62n80j46R74n2J07j221k95K83R56m72l91j59A742
1031939A569P35N77O0N02l38R2p6r08m15N14J191L84j51l71J00p1l02j36o0L80C221
1014540B881K73j356m31J32N68k38L47J028r25L57q45J809j751J68N39J11m83j045B553
998577B507k52K06J043j286q93l61J210N22j82m26j088P19p67R58m4P21j21K27C190
982480C422r26q79p34L75m93O5J135m30P93j42m99l1k74M38K70q1N26j97Q22n23B672
964611A137L90L15M50k17o42K58M91l75M43K46L59m13o64n80P11K48l55L45K17B143
947391B047p41K9k79O90K95J371m69l32o79q40p54j58J480k36j26j02N53r29r29B28
$$ plain form
930014 1042 825 345 1153 1069 1265 853 1800 2415 1297 1958 2252 767 713 71 -243 -40 240 -10 -4 632 -101
911640 -189 -1006 366 1039 801 1143 825 1657 1466 999 1088 -392 -253 -886 -1914 -1894 -1340 180 2341 1816
894781 2033 1126 858 692 1383 1513 1509 2491 2268 1798 2422 1641 850 341 742 1073 1567 71 1893 868 1253
876921 1627 1446 1020 1180 1750 949 682 1074 45 1335 713 1565 816 2119 2148 1398 1090 1300 -187 55
859758 1411 1819 1696 1623 1967 2429 1579 1274 802 1232 1529 782 949 714 155 1502 1553 1732 1050 833 1167
841572 1017 1180 1104 865 977 1267 174 462 1431 831 778 1533 1096 1143 97 73 507 531 816 474 711 1407
822342 835 811 644 240 218 -273 -113 229 594 -89 1517 691 347 -322 -100 26 -282 -1052 -1280 -1395 -2052 -129
802923 425 -119 -128 307 286 177 972 520 423 146 967 -834 -359 -124 496 91 -441 -408 124 -170 -1587 -1315
$$ packed form
930014A042k17m80Q08q4J96m12R47O15j118O61K94j485n4o42l14K03K80k50OO36a01
911640a89q17J372O73k38L42l18Q32j91m67Q9j480J39o33j028K0N54J520K161A816
894781B033r07k68j66O91J30mR82k23m70O24p81p91n09M01L31M94j496J822j025A253
876921A627j81m26J60N70q01k67L92j029J290o22Q52p49J303K9p50l08K10j487E5
859758A411M08j23p3L44M62q50l05m72M30K97p47J67k35n59J347N1J79o82k17A167
841572A017J63p6k39J12K90j093K88R69o00n3P55m37M7j046k4M34K4K85l42K37A407
822342H35k4j67m04k2m91J60L42L65o83J606q26l44o69K22J26l08p70k28j15o57a29
802923D25n44rM35k1j09P95m52r7k77Q21j801M75K35O20m05n32L3N32k94j417a315
$$ plain form
783314 -1771 501 85 389 536 239 449 1139 647 917 429 -34 -687 896 1908 899 604 1630 1659
766225 2048 3100 3031 2677 3093 2442 1923 1975 1109 1136 883 390 977 633 1587 1661 1431 3353 2753 2881 2501 1880
746258 2981 3415 3641 4704 3846 3169 3630 4349 3726 3104 2488 2597 3531 3626 3820 3747 4549 4542 4261 3597 3222 4344
726093 4724 4382 3960 3064 3887 3389 2933 3939 3535 3671 3640 3448 4023 4354 3413 3333 3126 3738 4012 4220 4205
706662 3550 3792 3472 3276 3692 2770 2935 2565 2717 3495 3221 3686 3832 3670 3500 4093 3215 3234 2745 3371 3257
687047 3053 2579 3148 2867 3482 2892 3443 3360 3314 2940 3637 2501 2792 3449 3705 2937 3885 4431 3609 4567 4930
667246 4463 3993 3479 4130 4884 4423 4519 3877 4438 3916 4530 3198 3036 2313 2501 3988 3962 4364 3566 3646 2694
647256 1826 1675 3976 3954 2617 3661 2389 1858 2272 2913 3237 2021 2294 2887 2683 1712 1375 78 1422
$$ packed form
783314a771K272m16L04J47k97K10O90m92K70m88m63o53J583J012j009k95J026A659
766225B048J052o9l54M16o51n19N2q66K7k53m93N87l44R54P4k30J922o00J28l80A880
746258B981M34K26J063q58o77M61P19o23o22o16J09R34R5J94p3Q02pk81o64l75D344
726093D724l42m22q96Q23m98m56J006m04J36l1j92N75L31r41q0k07O12K74K08D205
706662C550K42l20j96M16r22J65l70J52P78k74M65J46j62j70N93q78J9m89O26C257
687047C053m74N69k81O15n90N51q3m6l74O97j136K91O57K56p68R48N46q22R58D930
667246D463m70n14O51P54m61R6o42N61n22O14j332j62p23J88J487k6M02p98Q0B694
647256A826j51K301k2j337J044j272n31M14O41L24j216K73N93k04r71l37j297A422
$$ plain form
629011 1605 1192 909 620 1831 1385 1109 -262 -250 -383 794 632 406 581 609 923 1193 982 265 636 1270
608658 1141 1026 956 1228 954 902 1234 811 1320 1399 2027 1543 1520 1021 1597 1211 1714 396 885 650 660 1552
587132 952 2263 1051 10 1275 1288 1083 374 768 984 -674 -1243 -1326 249 1358 635 -1531 -2287 -690
568366 709 678 396 246 340 -208 35 827 940 1636 1543 1264 941 1130 283 759 485 540 618 180 -51 1520 1451
545436 1219 941 1438 1661 1040 1693 1247 780 1135 2138 1861 1510 2475 3576 3068 2432 2888 3034 2948 3410 3668
524286 4680 4227 4718 3825 4591 4003 3821 3527 4113 3419 4007 4017 4297 3631 3176 3257 3207 3481 3385 2052 3418 2801
501914 2466 3212 2624 2884 2228 1529 1640 1474 1248 2447 1209 46 1341 -459 1055 393 665 -168 841
482407 129 457 -273 -362 -25 565 577 812 -211 4 97 367 408 1376 1723 1960 1437 1544 1446 1252 1126 2101 1799
$$ packed form
629011A605m13k83k89J211m46k76j371J2j33J177j62k26J75K8L14K70k11p17L71A270
608658A141j15p0K72k74n2L32m23N09P9O28m84k3m99N76l86N03j318M89k35J0A552
587132I52J311j212j041J265J3k05p09L94K16j658n69q3J575J109p23k166p56f90
568366G09l1k82j50R4n48K43P92J13O96r3k79l23J89q47M76k74N5P8m38k31J571A451
545436A219k78M97K23o21O53m46m67L55J003k77l51R65J101n08o36M56J46q6M62C668
524286D680m53M91q93P66n88j82k94N86o94N88J0K80o66m55Q1n0K74r6j333J366B801
501914B466P46n88K60o56o99J11j66k26J199j238j163J295j800J514o62K72q33H41
482407A29L28p30q9L37N90J2K35j023K15R3K70M1R68L47K37n23J07r8j94j26R75A799
$$ plain form
458570 1378 1595 1665 2487 1358 576 535 348 1092 1827 1338 879 1260 -142 -534 -1061 -351 5 118 -440 -580
436587 240 317 230 115 -741 -1301 -1748 -1428 -1819 -1510 -1539 -804 -891 -867 -809 -1973 -1460 -1234 -913 -446 -223 -1116 -679
412261 -105 -418 -520 -1147 -197 774 525 380 790 -96 -32 898 818 462 806 1672 1445 1373 2100 2557 2610 3283 3268
387677 3538 3472 3268 3319 2428 1788 1088 1077 924 1233 1060 317 13 525 1330 303 1704 1689 2819 6859 12571
365004 19289 21356 16519 9457 4349 3019 1960 203 155 -44 27 -93 -435 687 561 -71 910 1718 2418
344296 3479 5458 11499 19662 25272 21320 13510 8182 5636 5076 4167 2999 2647 2809 1779 2734 2404 1462
324511 2099 1452 1405 1446 -36 774 185 209 31 -100 -729 -524 -1190 -2398 -1428 -1110 -984 -656 -843 -479 -505
301217 -255 97 -626 -374 -1133 -1368 -595 193 650 728 783 355 591 -178 -123 -90 -701 38 -152 160 980 1375 545
$$ packed form
458570A378K17P0Q22j129p82m1j87P44P35m89m59L81j402l92n27P10L56J13n58e80
436587B40P7q7j15q56n60m47L20l91L09k9P35q7K4N8j164N13K26L21M67K23q93f79
412261a05l13j02o27R50R71k49j45M10q86O4R30q0l56L44Q66k27p2P27M57N3O73C268
387677C538o6k04N1q91o40p00j1j53L09j73p43l04N12Q05j027J401j5J130M040A2571
365004A9289K067m837p062n108j330j059j757m8j99P1j20l42J122j26o32R81Q08B418
344296C479J979O041Q163N610l952p810n328k546n60r09j168l52J62j030R55l30A462
324511B099o47m7M1j482Q10n89K4j78j31o29K05o66j208R70L18J26L28j87L64e05
301217b55L52p23K52p59k35P73P88M57P8N5m28K36p69N5L3o11P39j90L12Q20L95E45
$$ plain form
275442 116 -95 343 -122 271 32 395 324 314 137 -3 12 25 1002 1581 5803 11350 22080 31947 33340 25374
251665 16114 8322 4512 2482 808 118 120 -13 -557 -789 -1398 -1232 -578 -951 -706 -539 -162 -278 341 107
228801 -322 -19 324 619 1172 2375 4881 8244 10256 10028 6662 3946 2458 706 1622 951 -9 -263 140
206881 -264 -263 -32 442 598 248 20 -61 311 -663 -348 -676 -161 757 781 98 792 -108 647 -102 6 -1101 -2447
180082 -2217 -3122 -2953 -3317 -2864 -3446 -2278 -2495 -2994 -2292 -1250 86 3032 7581 14486 23111 28184 31198
158905 30978 34330 40962 53331 73543 107037 172740 324387 576394 846424 991775 907808 652493
143498 378961 182397 84490 40670 21758 11050 5647 1898 -179 -924 -573 2554 7819 12671 16270
125602 17476 15238 10260 5728 2037 -178 511 2463 9622 24379 40375 47966 40607 23872 9162 8
$$ packed form
275442A16k11M38m65L93k39L63p1j0j77j40J5J3R77N79M222N547J0730R867J393B5374
251665A6114p792l810k030j674o90Kj33n44k32o09J66O54l73K45J67L77j16O19A07
228801c22L03L43K95N53J203K506L363K012k28l366k716j488j752R16o71r60k54A40
206881b64JK31M74J56l50k28q1L72r74L15l28N15R18K4o83O94r00P55p49J08j107b447
180082b217r05J69l64M53n82J168k17m99P02J042J336K946M549O905Q625N073C1198
158905C0978L352O632J2369K0212L3494O5703J51647K52007K70030J45351q3967F52493
143498C78961j96564r7907m3820j8912j0708n403l749k077p45L51L127N265M852A6270
125602A7476k238m978m532l691k215O89J952P159J4757J5996P591p359j6735j4710H
$$ plain form
106372 -3796 -3541 -4902 -4535 -4601 -4541 -4383 -3978 -4290 -3348 -2987 -1799 -958 -104 846 735 5306 13243 21533 22643
82127 17010 7849 1692 -1050 -126 -2614 -3170 2302 -1774 -4672 -8225 10179 25675
$$ packed form
106372c796K55j361L67o6O0J58M05l12R42L61J188Q41Q54R50j11M571P937Q290B2643
82127A7010r161o157k742R24k488n56N472m076k898l553J8404B5675
66244B4664  $$checkpoint
##END=