##TITLE= Raman spectrum of Rhodochrosite � http://rdrs.uaic.ro
##MINERAL= Rhodochrosite
##CHEMISTRY= MnCO3
##JCAMP-DX= 5.01
##DATA TYPE= RAMAN SPECTRUM
##DATA CLASS= XYDATA
##ORIGIN= Department of Geology, UAIC, Romania
##OWNER= http://rdrs.uaic.ro � stud. Apopei Andrei Ionut
##LONGDATE= 2009/10/16 10:20:27.0210 +0300 $$ export date from JSpecView
##XUNITS= Raman shift (1/cm)
##YUNITS= Intensity (cnt)
##XFACTOR= 3.188736E-3
##YFACTOR= 1.58997053E-3
##FIRSTX= 3399.97
##FIRSTY= 3.26239034
##LASTX= 211.234
##NPOINTS= 1024
##XYDATA= (X++(Y..Y))
1066244 2052 3000 2059 1853 1347 2700 3562 4737 2249 3756 2215 1109 1857 2618 2676 3156 2626 2593 3228 2976
1050730 2151 2238 1998 2650 3657 2644 29 2173 4064 2784 3447 2534 2617 4062 3271 2719 1839 754 3118
1035868 1010 1267 1900 3738 2918 3331 2688 3135 3984 2229 842 1656 623 1588 2689 1029 3003 2522 1271
1020884 483 1857 2235 2654 1403 3452 3047 3432 3143 1326 3567 2541 2150 1357 2602 2662 1855 1186 1314
1005778 658 1203 1338 1352 2538 2456 2981 2566 2124 2555 879 1494 324 1281 445 2030 2804 2685 835 2128
989743 -158 1790 2983 3193 602 575 2676 3058 885 41 -100 332 506 2296 1755 2120 3148 3099 2825 3452
973568 1489 2035 583 755 1364 2935 749 1844 1248 2930 146 2238 -6 178 1024 97 2233 2446
958888 2598 1388 2387 523 1005 376 2679 2269 1294 1888 1453 1809 2070 1895 2124 -27 1409 527 1474
943267 730 1452 2639 2374 1400 2957 1418 2335 2645 4865 759 2393 2413 1396 1935 3074 1971 2477 2963
927521 2039 3528 3948 2187 1585 1263 2107 2707 1780 1733 3711 3229 2727 1877 967 1796 2086 3141 2110 2300
910800 2047 1202 3282 3958 5500 4002 2696 5003 4113 4560 4687 3028 1281 3108 4709 3748 4273 3455
895628 2829 4447 4012 2597 3949 3319 4147 3620 2049 4154 3934 4090 1669 4055 2712 3544 3566 5360 5014
879483 3441 2864 2894 1629 3234 2243 2588 1631 3456 3038 4142 2647 3615 2517 3396 3035 3956 3398 3549
863204 2268 2925 3233 3208 2577 4052 5194 4420 4294 4632 2761 2956 3076 4574 4259 4202 4501 3477 3244 4825
845918 3856 3072 3767 3685 3787 2479 3420 3489 3455 2311 3355 2763 3576 4014 3402 4413 3535 3483 3805 4210 2596
827607 3226 4612 4070 5620 2821 3458 3174 5359 3637 3115 4039 3538 2778 1452 1823 5747 4660 4875
811773 2785 3968 3365 3130 3631 3069 3782 3779 2726 1563 3381 2389 2570 4346 4636 3583 3804 2881 1664 3569
794032 4186 3092 4568 2839 1540 2607 2364 2585 2540 1882 1209 2453 2217 2901 3626 4938 -44 2078 3969
777035 3262 5213 3551 2230 1781 3215 3836 2985 1111 4739 5353 3472 4911 5280 4148 4107 5614 5416
760800 3861 3697 5059 4479 5521 4654 5144 3908 5734 3571 5641 4132 3980 4673 4848 4688 4760 4791 4317
743520 4205 3888 3563 3962 5355 7635 6308 4817 5453 5918 6458 5226 5629 7246 6442 6000 6444 6137 6744
726093 7256 5946 4698 6116 5890 5821 6318 3821 5299 5229 7232 5621 6710 6605 5914 4295 4995 5462 6973
708519 5694 7143 6110 4831 5420 5232 5896 4548 5048 5112 4827 4958 5103 5657 3899 3989 5680 5818 6009 6092
689860 7101 6276 5554 5349 6365 5990 6099 6903 6772 7276 6798 6968 6592 5690 5826 8081 6239 6844 7251 6091
671031 4821 5630 7762 6894 6319 6201 4365 5249 4299 6308 4383 4366 3559 5323 5804 4288 3610 5271 4320
652989 4836 4976 5205 4418 3999 4188 4185 2341 3334 2635 4460 4450 4598 3613 2792 3253 4485 2335 2298 2964 3105
632865 4473 2589 1823 1433 3456 2554 2498 1323 3033 2159 821 2068 1426 1936 1479 2187 3025 1177 2009
614494 2295 2220 2009 2944 2249 2052 2626 1495 978 2439 2564 2307 3018 2441 3500 3762 2402 2153 1877 3647
594985 2533 2913 3292 2711 3582 4372 3042 3430 3238 2863 2666 2271 642 3105 1995 3538 2259 2622 2400
576288 2963 2380 2793 1973 2987 1799 2772 1797 385 1517 1251 584 742 1302 9 693 1167 700 1603
557431 2985 2301 2020 3280 6197 11734 16384 20462 23081 21249 18319 13249 8609 5183 3224 2520 561
540418 1106 2182 873 1938 1789 134 1404 357 1635 2062 1664 864 1845 849 1265 2574 1941 941
522260 2804 2302 3342 3408 3835 3513 4596 3778 4357 4276 4667 5719 4862 7048 6540 7513 7546 6781 7810 6992
501914 6605 7452 6629 7225 7338 5413 6017 5682 4652 2559 3323 3488 3033 3424 3257 2947 2195 366 2534 2397
481379 366 1328 968 2103 2147 2982 -170 1792 2650 2131 2472 1041 3170 1692 1968 2626 4948 2362 3826
461694 3614 2482 3287 6793 6597 7731 11143 13179 20287 22092 25309 20570 18252 12620 10535 9732 6080
443938 5183 4600 3745 2100 3019 2616 3993 2656 3469 3899 2538 3536 2257 2179 2987 2630 2492 2246 2354 2934
422867 2934 2812 2820 3327 3717 3086 2469 2670 2504 2911 2773 3256 3364 2211 2538 4161 3630 2670 2630 3273 2587
400535 2262 3690 3018 3329 3551 3173 3034 2739 3958 2136 3621 2857 3033 2372 2665 2174 2406 2399 3845 2749
379066 1243 3399 2616 2406 1787 2436 543 1704 2326 2049 830 55 3153 1976 3035 1871 2228 2080
359572 2689 2807 1855 3623 3509 4384 6895 9249 12298 22002 34419 78738 217059 527932 885108 999830
342104 756151 399098 179976 94190 59799 45602 35176 26201 21263 16563 14249 13217 14168 12398
326719 9230 8653 7789 8343 6421 4819 5242 4601 4320 2573 4869 3298 3575 2699 1453 1687 1791 2160 2788
305671 2283 1607 2553 1549 3127 2449 3010 2698 2638 1732 702 1239 1251 3205 2322 1929 3820 2675 3064 5041
283316 4078 3517 3398 3557 3668 5326 7529 6274 8270 7613 5782 6057 5213 4423 4280 4217 4297 4485 5326 4537
260750 5008 4722 5771 4842 5520 4289 5975 5355 4653 3875 5066 4947 5870 4863 5116 5116 4201 5754 6583 6517
237973 6588 6009 8750 9554 13329 17847 26509 39084 57883 69870 67749 56123 39389 25743 15669
220748 12030 11432 8432 6973 7129 6691 6614 4715 5612 6166 6373 5447 5066 6368 6565 5644 7374 6343 5781
198756 5772 5577 5867 6163 5498 5984 6348 6309 4702 4861 5885 6623 6816 6088 6151 5962 4478 4290 4934 5312 5199
174218 5162 3926 4510 4114 3029 3391 2423 4068 4037 3502 3718 1610 1999 1782 1567 10 1863 2757 2493
151806 1699 2577 2543 1243 1009 -34 2818 1152 1977 1359 900 765 557 782 935 627 664 928 931 1196 646
126799 1444 275 1162 943 18 1593 664 1533 1814 2358 2226 3518 4167 4024 7050 8657 10911 11358 14887
103957 17208 18029 23310 30765 45632 69391 105253 155352 207123 243820 255060 233260 198223 151618
86994 111887 80634 57667 42613 31721 23512 18859 17497 16002 13387 12174 10925 10950 11144 11439 11685
67469 14740 13506
##END=