##TITLE= Raman spectrum of Rhodonite � http://rdrs.uaic.ro
##MINERAL= Rhodonite
##CHEMISTRY= (Mn++,Fe++,Mg,Ca)SiO3
##JCAMP-DX= 5.01
##DATA TYPE= RAMAN SPECTRUM
##DATA CLASS= XYDATA
##ORIGIN= Department of Geology, UAIC, Romania
##OWNER= http://rdrs.uaic.ro � stud. Apopei Andrei Ionut
##LONGDATE= 2010/09/12 20:14:39.0389 +0300 $$ export date from JSpecView
##SPECTROGRAPHDATASYSTEM= HE 532 (Horiba Jobin-Yvon)
##XUNITS= Raman shift (1/cm)
##YUNITS= Intensity (cnt)
##XFACTOR= 3.188909E-3
##YFACTOR= 3.34691438E-4
##FIRSTX= 3399.61
##FIRSTY= 2.11300343
##LASTX= 210.701
##NPOINTS= 1024
##XYDATA= (X++(Y..Y))
1066073 6313 3294 2799 2304 1809 1313 818 322 -174 0 0 0 0 0 0 0 0 0 0 0 0 0 0 0 0 0 0 0 0 0 0 0 0 0 0 0 0 0 0
1035702 0 0 0 0 0 0 0 0 0 0 0 0 0 0 0 0 0 0 0 0 0 0 0 0 0 0 0 0 0 0 0 0 0 0 0 0 0 0 0 0 0 33 66 99 132 164 197 230 263 296 329 362
994400 395 428 461 494 527 561 594 627 660 693 726 759 793 826 859 892 925 959 992 1025 1059 1092 1125 1159 1192 1225 1259 1292 1325 1327 1301
969332 1275 1250 1224 1198 1172 1146 1121 1095 1069 1043 1017 991 966 940 914 888 862 836 810 784 758 732 706 680 654 628 602 576 550 524
944753 498 472 446 419 393 367 341 315 289 263 236 210 184 158 131 105 79 53 26 0 0 0 0 0 0 0 0 0 0 0 0 0 0 0 0 0 0 0 0 0
911472 0 0 0 0 0 0 0 0 0 0 0 0 0 0 0 0 0 0 0 0 0 0 0 0 0 0 0 0 0 0 0 0 0 -1 0 0 0 0 0 0 0 0 0 0 -23 -46 -69 -92 -115 -138 -161 -184 -207
866475 -230 -254 -277 -300 -323 -346 -369 -392 -416 -439 -462 -485 -508 -532 -555 -578 -601 -625 -648 -671 -695 -718 -741 -765 -788 -811 -835 -858 -881 -905 -928
839663 -952 -975 -998 -1022 -1045 -1069 -1092 -1116 -1139 -1163 -1186 -1210 -1233 -1257 -1280 -1304 -1327 -1351 -1375 -1398 -1422 -1446 -1469 -1493 -1516 -1540 -1564 -1587 -1611 -1635 -1659
812488 -1682 -1706 -1730 -1684 -1633 -1581 -1529 -1477 -1426 -1374 -1322 -1689 -2011 -2334 -2657 -2750 -2731 -2711 -2692 -2673 -2654 -2634 -2615 -2596 -2577 -2557 -2538 -2519
787620 -2500 -2480 -2461 -2442 -2422 -2403 -2384 -2364 -2345 -2326 -2306 -2287 -2267 -2248 -2229 -2209 -2190 -2170 -2151 -2131 -2112 -2092 -2073 -2053 -2034 -2014 -1995 -1975 -1956 -1936
760630 -1917 -1897 -1878 -1858 -1838 -1819 -1799 -1780 -1760 -1740 -1721 -1701 -1681 -1662 -1642 -1622 -1603 -1583 -1563 -1544 -1524 -1504 -1484 -1465 -1445 -1425 -1405 -1385 -1366 -1346
733282 -1326 -1306 -1286 -1267 -1247 -1227 -1207 -1187 -1167 -1147 -1127 -1108 -1088 -1068 -1048 -1028 -1008 -988 -908 -678 -449 -219 -235 -231 -227 -222 -218 -213 -209 -204 -200 -195 -191
702770 -186 -182 -177 -173 -168 -164 -159 -155 -150 -146 -141 -136 -132 -127 -123 -118 -114 -109 -105 -100 -96 -91 -87 -82 -78 -73 -68 -64 -59 -55 -50 -46 -41 -37 -32 -27 -23 -18 -14 -9 -5 0 0 0 0 0 0 0 0 0 0 0 0 0 0 0 0 0 0
647090 0 0 0 0 0 0 0 0 0 0 -280 -325 -370 -416 -462 -507 -553 -598 -644 -690 -735 -781 -827 -872 -918 -964 -1010 -1056 -1101 -1147 -1193 -1239 -1285 -1331 -1377 -1423
612382 -1469 -1515 -1561 -1607 -1653 -1699 -1745 -1791 -1838 -1884 -1930 -1976 -2022 -2069 -2115 -2161 -2208 -2254 -2300 -2347 -2393 -2440 -2486 -2533 -2579 -2626 -2672 -2719 -2765 -2812
583027 -2859 -2905 -2952 -2998 -3045 -3092 -3139 -3186 -3232 -3279 -3326 -3373 -3420 -3467 -3513 -3560 -3607 -3654 -3701 -3748 -3795 -3843 -3890 -3937 -3984 -4031 -4005 -3974 -3942 -4599
553271 -4415 -4204 -3992 -3781 -3569 -3357 -3146 -2934 -2722 -2510 -2297 -2085 -1873 -1660 -1448 -1235 -1022 -809 -597 -383 -170
532198 43 256 470 683 897 1111 1324 1538 1622 1590 1558 1526 1495 1463 1431 1399 1367 1297 1216 1135 1054 973 892 811 730 649 568 487
503787 406 325 243 162 81 -1 -82 -163 -245 -326 -408 -490 -571 -154 -183 -572 -961 -1351 -1740 -2129 -2519 -2909 -3299 -3689 -4016 -3944
477079 -3873 -3801 -3729 -5700 -6452 -5841 -5629 -5417 -5152 -4852 -4552 -4251 -3951 -3650 -3350 -3049 -2748 -2447 -2145 -2257 -2308
455275 -2360 -2412 -2464 -2515 -2567 -2619 -2671 -2723 -1805 -1639 -1668 -1698 -1728 -1758 -1788 -1817 -1847 -1877 -1907 -1937 -1967 -1997 -2027 -2057 -1884 -1668 -1452 -1236
425873 -1020 -804 -588 -371 -155 62 278 495 712 929 1146 1363 1581 1133 720 307 -106 -520 1026 1196 1367
403571 1538 1709 1880 2051 2222 2316 2051 1787 1523 1258 994 729 464 199 -66 -332 -448 336 -556 -303 -49
381052 206 460 714 969 1223 1501 2066 2632 2970 2860 2750 2640 623 828 1032 1236 1440 1644 1849 2053 2169
358314 2599 3029 3383 4490 5549 4172 4634 5096 5557 6019 6482 6944 7407 7870 4858 6683 8508 10334 12160
337551 13988 15817 17646 19476 21882 29756 30539 47171 62708 89271 97464 106418 96779 87648 81009 82396
319921 88163 103496 140627 204648 309093 449962 598954 669211 638142 536144 486957 500738 575375
305502 683518 682132 548469 358614 206454 112960 71312 54064 50935 54168 68110 57462 45656
290995 34231 27296 22709 17313 22245 26972 24274 24780 15245 14880 18671 24858 35884 52654 59904 48641
273018 33682 22673 10047 6701 4292 1454 4074 0 1791 4724 1725 -767 -562 2483 2752 1498
254906 2957 -359 3036 1180 -518 6 1847 -1008 1262 5165 2676 3882 3059 2410 4236 5714 6049
235514 3560 8275 11371 10390 16040 18153 22932 26251 27666 31874 35431 37529 38184 38870 46775 56632 71470
215965 109105 175217 276359 437880 652912 864516 993138 954293 813941 606857 404401 236927
202072 137209 91082 61518 45772 32231 23910 19491 17453 10845 9807 9720 8475 2075 1290 4028 3450
183424 5713 6547 11174 13230 17936 17486 19797 23900 20897 20796 14795 8175 -1000 -4510 -6862 -4375 -4570
163457 7325 18776 31765 48356 48940 38848 28073 18250 9507 6617 1618 3424 6722 5452 5894
145705 4640 10001 8398 10919 11189 9967 14202 15884 19660 34128 48898 76075 89180 93797 82518 63086
126629 41210 31471 23572 22019 22561 24641 18362 17254 15416 20654 28003 32670 45888 58917 70216 77200
107408 82836 91915 105690 114896 119422 114652 98760 76016 55430 43521 35452 38631 37970 33376 32240
89255 35039 33539 37686 44150 49123 53509 53993 51510 50074 52732 49361 41532 36290 26923 16652 8221
69748 3598 2084 0
66073D277  $$checkpoint
##END=