##TITLE= Raman Spectrum of Riebeckite (blue, black and red) � http://rdrs.uaic.ro
##JCAMP-DX= 5.01
##DATA TYPE= LINK
##ORIGIN= Department of Geology, UAIC, Romania
##OWNER= http://rdrs.uaic.ro � stud. Apopei Andrei Ionut
##BLOCKS= 3
##TITLE= Raman spectrum of Riebeckite � http://rdrs.uaic.ro
##MINERAL= Riebeckite
##CHEMISTRY= []Na2(Fe++3Fe+++2)Si8O22(OH)2
##JCAMP-DX= 5.01
##DATA TYPE= RAMAN SPECTRUM
##DATA CLASS= XYDATA
##BLOCK_ID= 1
##ORIGIN= Department of Geology, UAIC, Romania
##OWNER= http://rdrs.uaic.ro � stud. Apopei Andrei Ionut
##LONGDATE= 2010/10/16 12:08:47.0673 +0200 $$ export date from JSpecView
##SPECTROGRAPHDATASYSTEM= HE 532 (Horiba Jobin-Yvon)
##XUNITS= Raman shift (1/cm)
##YUNITS= Intensity (cnt)
##XFACTOR= 3.188909E-3
##YFACTOR= 1.73854871E-4
##FIRSTX= 3399.61
##FIRSTY= 84.09438647
##LASTX= 210.701
##NPOINTS= 1024
##XYDATA= (X++(Y..Y))
1066073 483705 478051 482540 493682 482874 483040 484037 497007 489691 493183 490523 487363 468241 486033 498337
1054452 498503 495843 493848 485533 483705 475225 493016 489524 480379 494014 494180 472731 478551 488860 484037
1042755 483538 475890 494680 490689 489026 482374 495510 495510 494180 503991 498005 493516 485367 492517 490356 492351
1030196 490023 479881 495510 479215 499336 496841 484703 491021 494680 491187 500832 488028 499336 491021
1019132 496009 509477 486365 507815 497173 503325 491519 501829 511142 498337 494512 492019 493516 490689
1008003 487530 497505 495510 495344 503659 495510 491853 487530 500666 502329 491021 497173 506818 501995 507150 501497
995202 501663 506984 504656 498337 504988 505322 504988 509645 518290 514799 496009 498337 512304 518790 514135 498005
982311 490523 502993 523114 494512 485701 494846 501164 490855 513469 501330 503659 515297 504490 505820
970959 519953 498836 518124 510642 509811 525441 498503 489192 499002 496343 511142 511308 516628 504157 501164
958720 489358 506152 516960 510974 518624 531759 518456 505986 500332 506318 513801 507483 500998 511474 500000
946399 504656 508148 503825 518624 513136 523944 519787 515797 497173 499668 504656 524776 517294 510808 504323
934000 524776 503491 518456 505820 517792 524442 538245 523778 522780 522946 529432 514135 527769 524776
922350 525773 513801 534420 524776 523114 545394 520785 518290 531427 533921 511640 532425 521449 522448
910634 524110 536914 529764 533589 539075 527935 514633 512638 525607 529266 518956 503659 503159 518956 524276
897997 521949 530762 531925 532259 536748 534918 529598 535584 534586 513136 516628 539741 541736 524942 524442 522780
884428 525108 503991 506318 519787 533921 525275 529764 519455 507981 542734 535750 531261 525607 530762
872477 524776 524776 538079 531925 541902 537579 527435 526937 536248 528600 542900 520951 542401 538577 536582 537579
858729 537413 537579 553210 536748 529598 535418 521449 537247 528268 533422 531094 531759 549883 547888 543565
845750 539741 540904 541736 550383 548387 528600 535086 530596 540240 544729 539408 551547 548886 554373 547722 541570
831814 558530 533089 542568 528932 537413 532591 546060 533589 563186 534586 552378 546060 548054 541072
819537 544397 539408 543233 539907 548554 552876 549385 551879 542401 550051 538245 540572 548387 530928 554040
806301 545394 540738 528434 527935 544729 538743 540904 535750 535086 538909 548886 545561 537247 557033 551047 557699
792083 532425 535584 544231 529764 540406 533422 542568 549717 543233 539907 546890 544729 569671 566678 540074
778664 541072 554540 552544 549053 540074 558530 556535 545727 555039 553044 548054 560859 572331 568673 578983
765155 568673 586133 601098 575324 578151 564018 578651 556203 548886 566012 554373 541404 533589 561855
752464 558032 552710 548054 544895 551879 555205 567177 562853 550881 549053 544065 552544 546724 535584 557533
738779 535086 551047 543233 555537 563519 554540 561523 567177 594114 589458 587630 580313 561689 566179 563019
725003 545727 558032 558530 553044 551547 544231 552212 542234 560193 567011 554872 557366 563352 566012 563186
711137 558198 556535 560026 572165 560859 555371 568009 551879 556867 560526 549385 557699 558032 554872 561025
697176 565182 569338 554373 551879 580479 560026 558198 554872 561357 543565 567509 559694 549385 572331
684062 556203 559362 547556 552046 551547 574992 552212 565846 552710 576988 562687 571832 562521 574327
670863 573163 576322 578151 574493 570004 572831 573163 567675 575491 569172 583306 579481 598603 565514 571832
656632 579315 576988 574493 568341 577154 589624 570170 575158 565680 573995 595112 562687 543399 570004 581477
642301 571999 569172 558530 583306 565182 567675 571500 569838 568175 570336 567509 567841 571999 570336 565680
627876 568507 572664 563352 567177 570834 560692 555869 555537 552046 571666 572997 558198 563519 544397 569671
613354 569838 577486 576988 569671 578651 549219 568175 565846 577818 564516 587796 557699 560193 565182 586299
598735 565514 571832 568507 568673 566012 551879 585301 560193 571832 573163 568175 575990 575990 569006 571832 559860
583027 581310 567675 582308 572331 566512 583140 573495 572664 547722 566678 564848 571334 553210 563019 547888
568201 562355 543731 569172 576488 569006 571334 554373 554540 574493 559860 570834 552710 559030 554872
554268 587962 571666 568175 561523 572331 569338 558696 564848 572331 572331 558530 548886 576488 556037 558696
539244 576156 584137 582142 560526 561025 577154 572498 562687 576988 570668 572997 572165 572831 577154 592285 583638
523107 597273 582474 585135 569838 588460 581810 577985 581144 588960 581644 574992 604589 590789 574992 578317
507870 572498 600100 577818 579981 589624 604922 575657 575158 583306 578983 591287 582474 587296 589791 571002
492526 594114 562189 583971 572331 590623 601596 590955 592285 576654 589791 580645 586465 598105 557865
478113 582308 573995 579481 576988 574161 579647 568839 578651 566845 568673 568507 581310 571999 564516 571832
462566 571168 585967 571334 586465 581810 581144 594114 575657 598271 584137 582142 565348 577486 580645
447959 574659 573661 582308 578317 565182 566845 580811 573163 553044 566012 573827 585967 564184 579481 573329
432204 567675 576654 576322 566012 574493 578317 574659 565846 572997 570834 569505 577154 573163 579813 575990 570004
415280 568839 567011 588960 576156 565182 570502 582474 565182 583140 582806 586964 570502 582640 582142
400369 567841 566179 578317 585633 591953 572331 589126 595610 574992 584803 590955 585301 583971 576322 586964
384282 588294 596275 581310 585467 580479 595943 581810 588960 588294 581310 578651 586798 571500 584303 589957
368085 574992 593616 587630 597107 601264 587130 601596 607749 592451 618890 617060 633688 616229 643333
352867 643997 634354 646990 643000 654806 663785 660958 651813 665780 677086 704024 699036 718989 721982
337551 710010 708681 714167 712006 698371 695877 703857 717660 710675 722481 729632 712338 735118 711840 726639
321028 729298 714833 718158 715497 718989 716994 711174 712836 714001 745095 760559 772032 803459 837879 868639
304389 917858 951281 939807 906718 860659 833555 789492 762555 755239 741770 740606 732957 732957 727635 729298
287634 730296 732457 761557 746924 759894 794480 776190 794480 817426 808281 831394 828234 829398 806618
271890 816928 793982 774527 777352 774027 770868 752412 763386 749419 758232 758232 753076 738443 764384 751746
254906 753076 761058 742601 751081 755072 739607 758896 761391 776024 762055 771200 762055 764051 783338 776356
237803 793316 782342 780179 789658 791321 780845 764882 772863 797805 774527 769538 781178 773529 764716
221731 773031 785833 774193 788162 774859 799468 837047 849685 880612 927503 982708 1028268 1023612
206711 988528 943799 906884 873629 824576 820253 820419 790655 795144 784669 800134 795311 765380 778184
190434 799800 788162 793150 790989 807782 830728 905388 912870 938643 950449 961591 924010 925507 943299
174048 952944 951115 990855 1016961 996675 1017626 999003 990855 957101 914699 896409 891087 876622 869804
157553 846359 864816 856335 850515 875125 859994 875624 885767 888760 881111 857333 864150 874959 878284
140949 898404 895078 883438 897407 907050 900732 914699 898903 900898 915031 920353 913202 972565 950781
124234 958264 987862 1016628 1022115 1027269 1057533 1084304 1070502 1089624 1123214 1123380 1086631 1130696 1123380
107408 1108415 1096941 1101430 1116728 1104257 1125873 1138677 1143831 1127369 1137014 1188560 1254739 1315763 1374793
90469 1396741 1419355 1427503 1383938 1396907 1441802 1400068 1376954 1369139 1357998 1402561 1449452 1429000
74638 1400068 1404723 1421185 1423014 1418358 1442634 1434653
66073A468241  $$checkpoint
##END=
##TITLE= Raman spectrum of Riebeckite � http://rdrs.uaic.ro
##MINERAL= Riebeckite
##CHEMISTRY= []Na2(Fe++3Fe+++2)Si8O22(OH)2
##JCAMP-DX= 5.01
##DATA TYPE= RAMAN SPECTRUM
##DATA CLASS= XYDATA
##BLOCK_ID= 2
##ORIGIN= Department of Geology, UAIC, Romania
##OWNER= http://rdrs.uaic.ro � stud. Apopei Andrei Ionut
##LONGDATE= 2010/10/16 12:11:30.0022 +0200 $$ export date from JSpecView
##SPECTROGRAPHDATASYSTEM= HE 532 (Horiba Jobin-Yvon)
##XUNITS= Raman shift (1/cm)
##YUNITS= Intensity (cnt)
##XFACTOR= 3.188909E-3
##YFACTOR= 1.71318914E-4
##FIRSTX= 3399.61
##FIRSTY= 126.52585865
##LASTX= 210.701
##NPOINTS= 1024
##XYDATA= (X++(Y..Y))
1066073 571690 576353 564880 565448 567961 573313 567678 572622 576717 571975 573313 571934 572461 572582 578541 581460
1053674 590540 569501 584055 588797 595567 593580 581217 593013 586203 581744 589080 586973 594148 593864 592973
1041974 592648 586648 591756 589080 582717 594392 597999 593864 599581 596215 602458 601485 593418 598972 591269 600877
1029405 608863 610646 605012 607485 613525 608701 609431 610038 609431 606310 602255 603755 607323 611214 616646 603349 618065
1015959 610565 611295 606025 606795 614133 605417 606228 611984 608052 620983 626375 621226 616443 623537 623011 630023 631725
1002415 626861 616403 623132 628321 630064 625483 626577 627591 632780 634482 625119 623375 636184 633874 632374
990379 635414 627347 634929 627713 621916 632942 637320 626213 633306 640522 641779 638820 644211 653494 634725
978266 636306 644575 648873 652561 652846 645103 638455 647049 649319 645347 659614 657831 658804 654791 653089 650494
965258 654427 658886 658074 663263 659777 653697 660831 672425 673802 669830 674411 653940 657548 654304 657304 668615
952160 667479 663993 667398 671898 665452 676600 671817 657142 659614 647900 663993 664154 664601 665169 672992 658844
938970 657386 676802 674006 676559 683775 675668 684748 674857 677654 674370 669506 667601 676519 672911 681951 693260
925686 691031 694964 689207 692409 682518 692977 692449 690788 696625 694963 681708 694800 697072 686734 679478
913149 696098 696504 687788 683856 696219 695774 687505 682559 695490 702219 717664 711826 705908 701814 707367 711339
899687 698287 703840 708299 705786 712313 728001 730514 723906 723176 729541 719285 721231 714339 720785 720947 719893
886131 713609 708299 712758 707975 722731 726338 723744 735460 735460 737973 735135 737973 743526 737892 732865 733311
872477 738377 723744 729663 727595 735135 739149 750620 749242 758565 732905 738581 739959 729906 750499 745836
859589 737526 752646 761038 755728 745593 747255 735986 738377 736554 735500 746323 744621 751999 761200 753255
846619 755160 772550 763673 754065 755525 757877 751755 765983 744336 742270 748999 753822 758362 766713 771983
833561 765740 773199 766106 763106 759741 759498 765294 767281 769591 764079 761322 762781 772186 793306 787995 771740
819537 774010 767362 763511 764443 780779 777333 775348 766794 763836 775835 761484 779280 775672 776686 779482
806301 783334 777050 795414 778266 770361 762579 763389 766024 776929 774942 772874 784630 781875 789130 793102
792973 774456 789130 772065 778388 783820 775793 780252 781347 775105 789049 799750 797318 782766 794440 794035
779561 795899 795333 798616 787792 781509 783658 782320 802792 789455 792697 787428 797521 799588 799954 798818
766058 798331 804737 805547 813695 821154 806602 799507 796467 797967 800764 807696 810209 803034 823222 808830 811263
751555 817182 817303 814870 809479 811263 813938 811872 810736 809560 811263 819410 821478 824722 824113 836923 830072
736948 827478 824559 827721 834693 837491 820586 864002 884676 883825 864042 858408 847909 839557 833234 821843
723163 830275 850260 838747 840287 833964 831937 831410 833517 837125 859057 852084 854881 853260 853826 851394 850341
708352 847016 852570 839031 844869 836559 843976 834532 836031 840247 847705 842922 855286 860840 845354 847179
694372 840004 845112 853786 851435 856178 860678 840693 841463 858204 856300 854840 859015 855611 846571 862948 860759
679358 868137 859502 861002 851435 840491 848354 862015 869799 869718 857070 861731 864731 883053 884068 880094
665180 880662 877866 880094 884513 878068 882446 878473 875838 876284 882770 871258 872677 881432 887635 894445 893350
649956 897445 891405 880338 875554 872758 875149 874501 892701 868137 873730 874177 884595 888891 888161 898539 889823
634621 888810 873852 876528 878798 866677 882649 882162 883095 877541 873852 883176 877460 878513 877784 863474 876892
619174 858204 872879 876609 886378 871379 875919 891931 885972 877743 886580 875190 881149 893796 883743 874703
604592 883297 889702 883378 897160 895215 891201 902998 896066 895945 900930 891729 908633 903281 897445 897728
589913 888446 895256 906363 905470 906160 890635 877987 878311 900647 914916 900322 892824 896715 902917 906119
575131 898620 899066 906930 912686 896552 893675 899147 890229 895539 896715 886216 895094 895864 896390 883906 890350
559254 895580 891242 891891 887999 884797 893026 893918 899998 904944 908835 900890 900039 904295 910091 912808 900160 906930
542258 895215 897039 893715 891567 898904 911267 904700 910416 914713 897120 912038 905551 910538 904011 903200
527152 903362 917875 923509 916740 927887 926509 928172 919780 913254 917388 915199 933725 937535 931089 920956
511943 924483 917267 936359 929834 926145 936806 922618 903281 918564 935589 923996 935184 900120 917632
497653 930482 922375 930523 924077 918767 925455 930644 912361 917307 934008 926996 943130 931617 920996 923915
482240 920388 917024 915727 916335 903809 918564 919577 919254 906606 902674 908511 915686 913578 916375 903849 898174
465683 901174 919010 918402 912565 920105 923550 919699 918848 924807 906849 911673 903809 904700 903200 891080 907903
449006 916294 923428 923956 899228 889540 911957 909727 900890 915767 911186 911065 914470 908754 909240 908593 902674
432204 899917 886418 897647 912767 894567 904295 903281 896066 894769 903768 907255 898660 910781 905551 910740
416340 902795 895094 909970 899107 905187 887432 907740 909727 910335 909484 907336 915484 914673 928861 920226
400369 913943 922294 917997 921280 926753 912361 921888 925334 917754 917916 927077 917592 925374 928131 931738 920388
383206 914105 923753 915403 910903 908187 914267 915484 911673 924645 928982 927239 925496 920267 909281 916618
367003 910538 911714 924360 913497 923307 911065 913133 913821 925253 930685 942400 940818 953912 943007 945764
350684 951399 955372 964086 960884 966843 976289 981112 986788 986544 981316 1001421 1013218 1015041 992666 1007056
334255 996151 998057 989017 989058 995908 990517 993233 1016298 1025825 1018447 1018528 1010907 998300 999962 986018 1001219
316604 1002110 1009934 996436 995585 994409 1001746 1014677 1023514 1025419 1038553 1042688 1065064 1074144 1071510 1048850
299933 1034459 1024163 1006854 996800 1004746 1002395 1010137 1008475 1015650 1003084 1012001 1016623 1020311 1031946 1029433
283147 1046295 1063970 1082900 1089589 1099844 1105966 1090643 1116059 1117681 1111236 1109492 1087845 1075482 1072118
267373 1061983 1065591 1064253 1060849 1056875 1059430 1070902 1058254 1073861 1077346 1063726 1063970 1052497 1065307 1062673
250357 1082941 1080428 1078441 1090602 1085738 1080307 1071266 1077184 1076780 1093157 1110222 1105520 1096642 1097129 1102358
233221 1086589 1097574 1094656 1100088 1091251 1102075 1097088 1080711 1085373 1097088 1074874 1086184 1081117 1090806
217119 1091048 1095669 1115776 1115208 1138719 1167257 1207226 1228139 1228950 1206297 1189345 1155015 1138070 1133409
200910 1112817 1099967 1094818 1098344 1086184 1079131 1071348 1082698 1090967 1091900 1096318 1092062 1098386 1114276 1131139
183424 1161825 1185701 1195964 1205603 1200901 1205321 1195105 1217194 1202641 1212128 1212939 1224612 1242493 1218088
166992 1215654 1212492 1188746 1159070 1127613 1131788 1126154 1127126 1130490 1111722 1109979 1096521 1087157 1105033 1115006
149265 1119424 1126518 1112492 1114155 1105479 1115532 1105196 1123154 1128747 1118410 1123437 1119140 1125626 1124207
132606 1128383 1119059 1138923 1136693 1138517 1142733 1155218 1168920 1174879 1210917 1206379 1219310 1240870 1249793
115835 1252626 1269695 1274644 1279300 1266451 1268602 1259644 1255471 1270906 1273339 1276184 1275491 1281204 1311240 1306385
97742 1299978 1317564 1358227 1419756 1477970 1512179 1541898 1557744 1533998 1503186 1518951 1515224 1521749
81957 1492771 1499460 1495040 1523618 1520373 1522842 1526733 1505573 1500835 1501646 1517904 1538982 1528637
66073A564880  $$checkpoint
##END=
##TITLE= Raman spectrum of Riebeckite � http://rdrs.uaic.ro
##MINERAL= Riebeckite
##CHEMISTRY= []Na2(Fe++3Fe+++2)Si8O22(OH)2
##JCAMP-DX= 5.01
##DATA TYPE= RAMAN SPECTRUM
##DATA CLASS= XYDATA
##BLOCK_ID= 3
##ORIGIN= Department of Geology, UAIC, Romania
##OWNER= http://rdrs.uaic.ro � stud. Apopei Andrei Ionut
##LONGDATE= 2010/10/16 12:12:29.0120 +0200 $$ export date from JSpecView
##SPECTROGRAPHDATASYSTEM= HE 532 (Horiba Jobin-Yvon)
##XUNITS= Raman shift (1/cm)
##YUNITS= Intensity (cnt)
##XFACTOR= 3.188909E-3
##YFACTOR= 1.53387919E-4
##FIRSTX= 3399.61
##FIRSTY= 51.22565809
##LASTX= 210.701
##NPOINTS= 1024
##XYDATA= (X++(Y..Y))
1066073 333961 340935 328308 336977 328685 319637 334903 348662 346023 335658 340181 334903 330946 330004 334903
1054452 336411 347719 342819 330946 334150 334526 336411 344515 339238 344892 334338 333018 336977 340746 348662
1042755 340370 339238 342442 333773 332265 336223 353184 342631 337542 344703 349792 342066 344703 341311 339238
1030983 349604 344327 342819 349792 340181 344327 346588 348096 343574 349792 344327 348284 345647 333585 348851 349604
1018339 349039 346211 340746 352808 345080 340558 341878 341878 357896 356389 344515 343950 338674 344892 341688 347531
1005610 339991 346588 344892 336034 355824 346400 342631 355447 340181 340935 343007 349980 358840 346400 339615
993597 355824 344327 354504 356577 349604 337919 351300 346023 351488 343950 353751 350735 359781 344515 358461
981505 356577 352808 342254 355447 345270 341123 349415 359028 357708 357143 352243 358650 347154 356200 351865
969332 357520 353184 349980 369393 339615 337166 351488 348662 352243 362608 355824 349604 352243 348472 350735
957083 354316 362797 350923 356577 364116 360157 360157 345647 352620 348096 364493 349227 358273 349604 349415 358840
943925 369017 370713 369205 370523 358085 359969 348851 355635 369770 363173 341878 355257 357896 360724 355447
931510 358273 352243 373915 355447 381455 374858 354881 360536 369958 364681 356765 372031 366754 372786 373350
919010 362985 369958 366377 352808 363362 362797 358085 366377 384847 371278 383528 372786 367697 378251 357520
906429 388993 372409 371654 360912 373539 364681 361477 349980 353751 359216 360912 373350 367509 383716 376743
893766 392952 385789 381267 370901 381643 377119 365058 382208 381267 378627 382963 361289 388616 376555 359404
881022 391255 373915 375235 382774 382020 384092 372031 392952 378439 383151 395213 371466 370901 382774 390124
868190 381455 377119 390689 378251 381455 393140 380890 381455 377686 397852 381643 389181 389936 406898 398417
855277 387863 381267 398228 395401 376366 384659 393893 395778 396344 387675 392197 383528 395024 398605 394270
842276 395778 393140 389936 395213 393516 389748 376931 389559 400301 401244 408217 402941 405390 400301 394836
829190 396532 380323 384282 401244 404070 404637 404070 401433 391820 391255 381643 402562 407274 398040 396156 406709
815135 395024 406521 405766 396532 403505 410290 398040 389936 392197 392763 385412 403129 389559 394081 395778
801867 392197 398605 402941 401244 393140 407463 408406 396909 411798 398417 399358 383339 402941 400490 418016
788514 411043 395589 421409 411610 402562 385600 414059 414814 407463 395589 415944 420091 403129 406898
775968 415190 415567 423295 401809 408217 404258 418959 426497 425179 427252 434413 425368 422163 424991 430080 417828
761536 418016 413494 432341 426497 420656 425744 398605 413494 407086 415567 400866 408782 410855 422917 410290
747914 405390 411232 407839 412928 407086 425932 404447 413494 412175 432529 424801 428760 409535 414247 408406
734198 428193 440822 426121 435921 459856 452695 450056 433849 431021 433849 429701 427440 418583 419712 431964
720394 435168 432529 415190 421032 428572 415379 422540 433660 436110 424236 438371 432152 430268 416510 425744
706492 422352 437241 427817 437806 435921 417451 418206 431964 421787 425368 427629 437053 420091 423860 421220
692500 416132 435168 416320 430644 438371 418395 433660 408217 441198 425744 416698 432152 413118 422540
679358 415190 426875 433282 430268 450244 418771 438937 443649 437994 429325 435545 450999 425744 433094
666131 436486 428572 432529 434602 444779 452507 444214 452507 440822 459480 442329 439878 434790 435356 443837
651866 443083 457219 460799 436864 440257 454956 442706 446475 444402 449303 436674 450244 435545 442329
638466 451187 445722 446663 442894 449303 450622 440257 440445 437429 428572 421599 438937 431021 444591 431586 435168
623047 433472 443083 442141 433849 434978 449867 438561 438182 432341 427817 446663 457029 440257 444026 447795
608490 441763 451375 450056 450434 460799 447795 446852 461176 454768 457029 452695 456840 450244 459103 445910 452130
592858 442329 458348 430268 445722 452130 445722 453448 456276 461364 460611 463437 462872 447418 452130 444402
578097 443271 449114 445345 453071 456087 455144 448548 439314 433849 428572 437241 462307 457407 464757 456464 445534
562239 441386 453826 458160 469845 463625 454203 446475 471353 454391 456087 460988 455899 460421 454015 452130
547272 451564 455899 439690 434790 465888 459668 460799 443459 459291 453826 465321 455522 462684 463249 445722
532198 451752 468902 452695 469657 459668 464003 477006 468902 484734 460045 456276 469657 461364 466076
518039 482662 475687 475499 465888 467396 481154 479269 472106 484168 469845 472861 464380 479269 476253 469280
502768 460421 460421 461552 464757 457783 486054 477006 482850 472861 463060 470788 454203 484358 474934 485864 480399
486361 486619 457407 456464 462496 459668 456276 456087 464945 467961 469469 465133 479457 462117 464568 457407 464380
469835 460233 466641 475877 470788 467584 466641 463249 476630 467018 486619 481907 482850 481907 464568 475877 483038
453186 473426 477573 488127 467018 477195 482095 487560 471918 460988 461741 466264 472673 454956 463249 461929
437469 466453 474557 469469 470788 483603 482283 486995 500565 459856 481530 473802 466076 493404 470033 478326
421640 468149 477950 482850 471541 475310 473991 463625 478326 471165 482662 485299 462307 486807 462307
406769 476818 488880 481530 467961 473802 479457 479269 464945 479457 471730 488127 490576 479646 490199 480775
390729 476818 502261 483791 491142 493027 485299 478514 487184 491519 495288 482283 483038 486242 502261 484168
374580 497172 505465 484358 491142 498492 491142 488880 509422 503204 494345 493215 510930 497737 500188 500377
358314 532228 516395 523370 524123 526951 531851 535243 554843 558047 545609 547493 562759 547305 557859 570485
341938 576517 582170 599509 601772 606105 589898 608368 599887 600075 561439 584055 594798 604787 597436 601772
325444 610441 605540 609498 609121 602525 593855 581041 586129 579154 606860 590463 612325 591406 628344 614398
308838 613078 639276 661326 699962 727101 751978 739916 713720 685450 668488 655107 637392 625706
294350 628534 614964 628156 632491 625330 628156 634376 649265 637203 647569 643988 660383 662268 686769
278650 682246 692611 707312 704484 716736 702976 691858 687334 684885 662646 682057 676404 674141 665472
262847 650395 667356 640784 677724 665095 671127 665472 655483 670749 655483 643800 662834 671127 683377
246940 689219 673765 696758 694496 702976 706181 694119 709008 716546 713720 706181 704863 701470 706369 700339
229780 700151 687711 695627 699208 688842 689219 717677 712024 709951 692423 692989 725593 702223 713720 743497
212499 774407 802110 837919 879192 877308 855445 847343 773652 761967 741048 734639 717301 736712 690727
196260 701470 698643 708065 706369 694119 709385 723143 740671 718997 731623 739351 775724 798718 822653
179912 818129 834338 838295 823406 852808 848096 866001 850357 883904 902939 896342 875800 858273 844139
163457 793818 781944 776479 783452 780813 779305 760082 764982 773463 784584 807011 795326 797210 788541 797963
145705 786656 792686 803618 781756 796457 792498 805879 802487 812664 808330 804183 810403 811723 825857 825857
127826 842064 845835 854316 868074 897097 892385 927252 919148 933659 952883 947040 967582 986807 976063
111023 975499 1011683 978891 999057 990764 1000188 1006595 990576 1011119 1019223 1005089 1001318 1062759 1064455
94108 1140594 1187334 1203353 1249905 1276289 1277985 1271767 1253109 1283074 1268563 1263851 1225782 1236900 1283829
77080 1278740 1290425 1255558 1242555 1270259 1288353 1299659 1292122 1300979
66073A319637  $$checkpoint
##END=
##END=   $$end of all blocks