##TITLE= Raman spectrum of Rutile � http://rdrs.uaic.ro
##MINERAL= Rutile
##CHEMISTRY= TiO2
##JCAMP-DX= 5.01
##DATA TYPE= RAMAN SPECTRUM
##DATA CLASS= XYDATA
##ORIGIN= Department of Geology, UAIC, Romania
##OWNER= http://rdrs.uaic.ro � stud. Apopei Andrei Ionut
##LONGDATE= 2009/12/11 02:44:10.0008 +0200 $$ export date from JSpecView
##XUNITS= Raman shift (1/cm)
##YUNITS= Intensity (cnt)
##XFACTOR= 3.188909E-3
##YFACTOR= 6.7358898E-4
##FIRSTX= 3399.61
##FIRSTY= 0.43202111
##LASTX= 210.701
##NPOINTS= 1024
##XYDATA= (X++(Y..Y))
1066073F41K54r07J370l18J613J48m83p07Q5k81O33q52O11J64M88m88p93N47J82A172
1049782A597P08o75J59L00m52oM62k30Q27p18k72n37L38O62J54J33K35r45l76K33B115
1032557B368k34R23L34l58r06k16J50p04J064k78q67M13K7K30r5N34p46J27l60A533
1015959A823J48M31M6q69L70p88M72m22k20N94j18J082q50K89r51O4P16l01J26B174
999213A609J05k60O4K68K48q50j6N12m24n7K07J06L29o06j094J488r7P36j59MA772
981505I02k19J46K89K08K69r7k39k40J07L30K5n64k39P37q28M53l40K6P17P78A434
963624A582j295M33l80R01J48K10j56O77o23j660O17O17Q8l38j35J90J70O99p85A436
946399A728p3p03j55K9n20J065k96P41r26N78j109L55j13j74M16J352j170j73A513
$$ plain form
1066073 641 895 -12 1358 1040 2653 2801 2318 1611 1696 1415 2048 1196 1807 1971 2459 1971 1178 1725 1907 1172
1049782 1597 2305 1630 1789 2089 1637 1631 2093 1863 2690 1972 1700 1163 1501 2163 2317 2450 2685 1740 1364 1597 2115
1032557 2368 2134 3057 3391 3033 2127 1911 2061 1357 2421 2143 1276 1689 1716 1946 1851 2385 1639 1766 1406 1533
1015959 1823 1971 2402 2448 1579 1949 1161 1633 1211 991 1585 1467 2549 1699 1988 1037 1101 1817 1516 1642 2174
999213 1609 1714 1454 1518 1786 2034 1184 1168 1680 1256 1199 1406 1512 1841 1235 141 1629 1532 2268 2109 2113 1772
981505 902 683 829 1118 1326 1595 1498 1259 1019 1126 1456 1481 917 678 1415 587 1040 700 726 1443 2221 1434
963624 1582 287 720 340 1241 1389 1599 1443 2120 1497 -163 454 1071 1159 821 686 876 1046 1745 960 1436
946399 1728 1655 952 797 826 306 1371 1075 1816 890 1468 359 714 601 427 843 2195 1025 852 1513
929848G50M17k54n1J0r1r1K34K14M79n59K55n58r03N80J94J54K56J74L77l13R3F27
910634B9J232N00m76m76J55L3k11k32J96k72L99q41J192o78R89j70l53K16j044d2
892920G3N01N62q8o98P05P4l32o7k51K37m13J356q81j08j08O85l52J15k91J57A6
874189H22p38R90k91M41j89K58n55m13o7J437o77m53O65k91Q68q81l72j89l11c4
856139A343j69K98p58J36Q88p58L19pN5j08n15p18N22O24m74M20J36n76L39m94A10
837051D89n15O64M00n56O85N62l12l12l53K57N62j08j512M81M19L18l94l32P3A017
818656B77O03L3J2q62J131m96M60o39o9M19J34J55m36O22m96n78J54n57O62j71A040
799204E84Q86m57rrk12m36P84l76k53O21n18n0K55k74K34Q85p21k13L97J0M38A413
$$ plain form
929848 750 1167 913 862 872 781 690 924 1138 1617 1058 1313 755 -148 432 626 780 1036 1210 1587 1274 1367 627
910634 29 1261 1761 1285 809 964 997 786 554 750 478 877 36 1228 550 1539 1369 1016 1232 188 -42
892920 73 574 1136 1048 350 1055 1129 797 730 479 716 303 1659 778 670 562 1247 895 1010 719 876 16
874189 822 84 1074 783 1224 1035 1293 738 325 258 1695 1018 565 1230 939 1807 926 554 365 54 -34
856139 1343 1174 1472 714 850 1738 980 1299 1292 1347 1239 724 6 528 1152 678 1098 1234 658 997 503 110
837051 489 -26 638 1038 482 1167 1729 1417 1105 752 1009 1571 1463 -49 432 851 1169 775 443 516 1017
818656 277 880 913 925 63 1194 698 1158 519 450 869 1003 1158 722 1344 848 270 424 -133 529 358 1040
799204 584 1470 1013 1004 995 783 347 1131 755 502 1123 605 555 810 536 770 1655 934 721 1118 1128 1566 1413
778664F92N59j32p42J108q85J73n59J555N18j535K74J006l57p01J046o41j53P1A123
760630A336j332J066l97M16J52q04O60K33L34j393J046M36j434P61J107r46J92I75
743351A309j1k55j33r06L95L96P41q25J72M77l98l1K74J371K33n60J31j515L75G61
724085A8J189M97o41j1P1k14q85J006m38P1K74p1j12q24L15M17P01j006J027r46B66
703701I27q64L36P43J73m57J13m97l14m77J94J435q43j10P2O42j91n37L17O22C82
684062E36L3m8k8L18P4j09L3m54poK78m54K17Q68k70j68M41q19j68N64nnN6M63H07
659486A230Q90j549O67m92l69K61l90J135k26J80l89n51k66L43l47P91k46l67A138
640385A401O0j180Q54k85o51K24P73k64M2k23J058l24n68M29KK86j888J629l03D45
$$ plain form
778664 692 1251 1119 377 1485 600 773 214 1769 2287 752 1026 2032 1675 974 2020 1379 1226 1297 1123
760630 1336 4 1070 673 1089 1241 437 1097 1330 1664 271 1317 1753 319 1080 2187 1241 1433 975
743351 1309 1298 1043 910 4 399 795 1536 711 883 1360 962 931 1205 2576 2809 2249 2380 865 1240 761
724085 18 1207 1704 1063 1052 1123 909 24 1030 592 663 937 866 754 -70 245 662 1363 357 1384 438 266
703701 927 63 399 1142 1315 858 971 474 160 -317 -123 1312 469 359 431 1073 882 345 662 1284 382
684062 536 569 521 493 811 885 776 809 355 348 342 620 166 383 1251 981 813 1254 435 267 831 826 821 877 1340 807
659486 1230 2120 571 1238 746 377 638 248 1383 1157 1337 948 397 131 474 127 918 672 305 1138
640385 1401 1461 281 1135 850 199 423 1196 932 974 751 1809 1485 917 1346 1348 1634 -254 1375 1072 445
620143F2P75J488j278K5l63NJ183j053L91j78j37M93M52p06Q7m21n5K30O17j4I59
598735A189r4L32j75N36m40J91P40j354J91R03j13K9l2L35k56l1k14P41j637R04A958
577110B009P42J93o81R2j0n79J047p62K14m77L1Q86J12m36M17P3j11m77M79k13C190
555268C323P3N39l14N80o59J53j0J373k12o00q83J027O40K55L0K54o61O81j0O60F777
533207G376K53O18l57P00J91K32j76J492l18J471Q40p46J409O97o65J672O35K69A6390
512959A5987k61P75r12J201p9L87O31J83N49n30N48J00j161j061J054m72P68q80A5866
492526A6042m95q62l34J495p2O81q86p85p05K10J27j114J26N31j238K04n69J076A2759
471907A1943M84r61o97J375j126L15l76O79r68R82n85K68n05K1l66M26n52k4j28I527
$$ plain form
620143 62 837 2325 1047 1072 709 714 1897 844 1235 1057 920 1413 1865 1159 1246 825 770 1000 1617 1603 959
598735 1189 1095 1427 1252 1788 1348 1539 2279 925 1116 2019 1906 1935 1903 2238 1982 1951 1737 2478 841 1745 1958
577110 2009 2751 2944 2263 2355 2345 1766 2813 2051 2265 1788 1819 2705 2817 2381 2798 2871 2760 2283 2762 2549 3190
555268 3323 3396 3935 3621 4201 3542 3695 3685 5058 4846 4246 3363 4390 5030 5285 5315 5569 4908 5589 5579 6239 6777
533207 7376 7629 8247 7890 8590 8781 9013 8837 10329 10011 11482 12322 11576 12985 13682 13017 14689 15324 15593 16390
512959 15987 15726 16501 15589 16790 16711 17098 17729 17912 18461 17931 18479 18579 17418 16357 17411 16939 17707 16827 15866
492526 16042 15547 14685 14351 15846 15774 16455 15569 14784 14079 14289 14416 13302 13428 13959 12721 12925 12356 13432 12759
471907 11943 12427 11466 10769 12144 11018 11333 10957 11636 10668 11650 11065 11333 10828 10849 10483 10909 10357 10333 10205 9527
450050I295O00n19Q20Q8q50O13p31k24M45j000J17J213j432R85p44Q39j337k62H526
429040I358k260J967r43L16l17M8n7Q4l45J40n32K148k448N58J70o46R58r97M24G926
406769H000r05O38J68n67k24l28R29J435j963M94o27P73k87J377j208q44J063G500
386433F178J603m54r25M8k39J180n31m74j127j55K68M2l29k30k54l3O12j078n53C216
363748D281K5j260l08l12O60p68M29q57N42r87L71R96j263j085M75J102P72j936A030
341938B256j644o13K331q25Q37n29m12o00O96O51N04j758J592J23j386J841r29A303
321028A563J007p46P73j651r45J632M0j022L75o67K845j939J309r95P08p81Q6B283
299933I15K407j055L43m36N74o1Q47j95J119R93j861N73K438r03r6K074j329J228H470
$$ plain form
450050 9295 9895 9376 10196 10284 9434 10047 9316 9092 9537 8537 8654 9867 8435 9420 8676 9515 8178 7916 8526
429040 9358 7098 9065 8122 8438 8121 8169 8112 8196 7851 7991 7459 9607 7159 7717 7887 7241 8199 7202 7626 7926
406769 8000 7095 7733 7901 7334 7110 6782 7711 9146 7183 7677 7050 7823 7536 8913 7705 6861 7924 7500
386433 6178 7781 7327 6402 6450 6211 7391 6860 6386 5259 5104 5372 5414 5085 4855 4601 4568 5180 4102 3549 3216
363748 4281 4306 3046 2738 2426 3086 2318 2747 1890 2432 1445 1816 2812 1549 464 939 2041 2813 877 1030
341938 2256 612 -1 2330 1505 2342 1813 1401 801 1497 2148 2652 894 2486 2609 1223 3064 2135 1303
321028 1563 2570 1824 2597 946 1 1633 1673 651 1026 359 3204 1265 2574 1579 2287 1506 1592 2283
299933 915 3322 2267 2610 2174 2748 2687 3534 3339 4458 5451 3590 4163 6601 5698 5602 7676 6347 7575 8470
277525A1047K53K625J298K002O75L250N134K078L739M078L990M675Q083P447L252G1486
258313G5660K643P678O613K45N584m81L151r41k554m309l503l591M48l706J29G7252
238947G4868R82K034m133M520N956j450O167J159M892L300O465M953P041J1954A31710
220579A39909J2482L226Q423j646N787J0049N714J2557J0762J2584M955Q831K2851B78293
203233C10828L7103M1570N7134O0688Q6131R7204J04639Q6336O3642N4408k1507I15661
188099H40412j05038r5246q8011p1167o6884o2535m8882m8522l9378k9811k6460A37542
172874A16641j5641q632j4106p342l972p269N31k969o795N79k190M89n126L937E1417
154005E2358J3948P682J4509J5320K0622K8953L4094N1472N1550M0530L6826J1068C83329
$$ plain form
277525 11047 11300 13925 15223 17225 17900 21150 26284 28362 32101 36179 40169 44844 52927 60374 63626 71486
258313 75660 78303 85981 92594 92839 98423 97942 101093 100152 97598 93289 89786 86195 86643 82937 83066 77252
238947 74868 75850 77884 73751 78271 84227 82777 88944 90103 94995 98295 104760 109713 116754 128708 131710
220579 139909 152391 155617 164040 162394 168181 178230 183944 196501 207263 219847 224802 233633 256484 278293
203233 310828 347931 389501 446635 507323 593454 690658 795297 881633 945275 999683 978176 915661
188099 840412 735374 640128 552117 480950 414066 351531 302649 254127 214749 184938 158478 137542
172874 116641 101000 92368 78262 70920 66948 59679 60210 57241 50446 51025 48835 49324 44198 48135 51417
154005 52358 66306 73988 88497 103817 124439 153392 187486 238958 290508 331038 367864 378932 383329
137377C58613k3174m2773l5211l3649l3223l1637k0500j5235k1010j0460j4139F9683
121838E9690P41m891l15j556k693q241K390j266l827m618o566k744j521l166n256A6640
101371A6655l701m166n808J962l726l06r10R04L267K685J734M953P480K852O539C2468
80739D1910L61Q666J1499O142K186k946p003l434j2429p479B3258
$$ plain form
137377 358613 335439 292666 257455 223806 190583 158946 138446 123211 102201 91741 77602 69683
121838 59690 60431 55540 55225 53669 50976 42735 45125 43859 40032 35414 28848 26104 24583 21417 16161 16640
101371 16655 12954 8788 2980 4942 1216 910 0 904 4171 6856 8590 13543 21023 23875 30414 32468
80739 41910 42271 50937 62436 68578 70764 67818 60815 57381 44952 37473 23258
66073A4481  $$checkpoint
##END=