##TITLE= Raman spectrum of Siderite � http://rdrs.uaic.ro
##MINERAL= Aragonite
##CHEMISTRY= Fe2+CO3
##JCAMP-DX= 5.01
##DATA TYPE= RAMAN SPECTRUM
##DATA CLASS= XYDATA
##ORIGIN= Department of Geology, UAIC, Romania
##OWNER= http://rdrs.uaic.ro � stud. Apopei Andrei Ionut
##LONGDATE= 2009/10/16 10:00:10.0821 +0300 $$ export date from JSpecView
##XUNITS= Raman shift (1/cm)
##YUNITS= Intensity (cnt)
##XFACTOR= 3.188736E-3
##YFACTOR= 2.15462862E-3
##FIRSTX= 3399.97
##FIRSTY= -0.10954291
##LASTX= 211.234
##NPOINTS= 1024
##XYDATA= (X++(Y..Y))
1066244e1M84K57J86J66J1l27l48o5k12J76K76J05K31l03j12K41J95jm89L76K90A840
$$ -51 433 690 876 1042 1053 726 378 313 101 277 553 658 889 586 474 715 910 909 420 796 1086 1840
1048390A109O17p26K24m84p62J94O22l49M61l70K85k14J59L45n51Q03n26K3N10D77
$$ 1109 1726 1000 1224 740 -22 172 794 445 906 536 821 607 766 1111 560 1363 837 860 1370 477
1031939F10j88L09L49k94K69p83J18O76j135J310k29O41q33o57k04K88N66qK03A377
$$ 610 422 731 1080 786 1055 272 390 1066 -69 1241 1012 1653 820 163 -41 247 813 805 1008 1377
1015333G00O61l65n92O06n07j89J08Q32L09n47Pm20J47l20m40N55L09K48o16K99H57
$$ 700 1361 996 404 1010 503 314 422 1254 1563 1016 1023 603 750 430 -10 545 854 1102 486 785 857
997778F88j79k49J12r3K18O11l60J49m11K34Q22j124K64l05k64L29J04Q42m00H95
$$ 688 509 260 372 279 497 1108 748 897 486 720 1542 418 682 377 113 442 546 1388 988 895
980862A024l50M3l19O67l14k39l79K49O97n70J59P8m90J327n20L20k13k38k23F92
$$ 1024 674 717 398 1065 751 512 133 382 1079 509 668 746 256 1583 1063 1383 1170 932 709 692
963793A038p01Q69n25J55o40J64O13j234J509m84o40J116oN73n19o96k62K31J81G91
$$ 1038 337 1206 681 836 196 360 973 -261 1248 764 124 1240 1234 1807 1288 592 330 561 742 791
946566G76O49p00J036l88j20m53m83J147q66O70j263N99J16k71J112J72p95N19F78
$$ 776 1425 725 1761 1373 1253 800 317 1464 598 1268 5 604 720 449 1561 1733 938 1457 678
930014D83j51j4J022n92L98l9Q2j10M90r5m91o98O96n57M09n07Q07K99q9m36k79A254
$$ 483 332 318 1340 748 1146 1107 1189 1079 1569 1474 983 285 981 424 833 326 1133 1432 1343 907 628 1254
910800A261M80j105J89r3L7J59N16p02p87N76R18k73j84o31K10N76P4l39Q18o91A174
$$ 1261 1741 636 825 732 769 928 1444 742 -45 531 1449 1176 992 361 571 1147 1221 882 1700 1009 1174
892241G09L51ML25o35M97o55M9Q34r77K20M0RL41P44j309O23O49p55K96k52l43A077
$$ 709 1060 1064 1389 754 1251 596 645 1479 502 722 762 771 1112 1856 547 1170 1819 1064 1360 1108 765 1077
872644A092Q80j530R36J06n54K77o14J31L13J41L42p14J21r5L73n5J052j056l21F95
$$ 1092 1972 442 1378 1484 930 1207 593 724 1037 1178 1520 806 927 832 1205 1150 2202 1146 825 695
854580I27L94j30l31P15o38k35J97P41l66K27L99q59L99m66J52o9n32M95J7O7I75
$$ 927 1321 1191 860 1575 937 702 899 1640 1274 1501 1900 1041 1440 974 1126 1057 525 1020 1037 1104 975
835475A842j020J28K58m86m25J73Q72j024J265o27L29Q02l09k65j68j99m3Q43A364
$$ 1842 822 950 1208 722 297 470 1342 318 1583 956 1285 2087 1778 1513 1345 1146 1103 1946 1364
817945F12L80J03j83J53J29p8R3J39o77K75o57R49J29o3n70j74N57L05m95j7J18D83
$$ 612 992 1095 912 1065 1194 1116 1209 1348 671 946 289 1238 1367 1304 734 560 1117 1422 927 910 1028 483
797595C35O47l99n70k7N01l79O57K30N06n14k49k6p97R95l39n60M06L25K25k98G28
$$ 335 982 583 13 -14 487 108 765 995 1501 987 738 712 -85 910 571 11 417 742 967 669 728
777932G41O48n85m7k58N32p76K50K40k33K81k43M36K76p66P53J65n50M9K61kK36D66
$$ 741 1389 804 757 499 1031 255 505 745 512 793 550 986 1262 496 1249 1414 864 913 1174 1172 1408 466
757175A113k6o35Q49R70j007q27J363m04J05L91L91J35j204M17J25j17K25K66B551
$$ 1113 1087 452 1301 2271 1264 437 1800 1396 1501 1892 2283 2418 1214 1631 1756 1639 1864 2130 2551
738948A333l2N83n49J342m79o45L21J367J00j490n35o65J227oK00n59O93O03p11A715
$$ 1333 1301 1884 1335 2677 2198 1553 1874 3241 3341 1851 1316 651 1878 1872 2072 1513 2206 2809 2098 1715
719636A880N12o09O63m49o6l03P48M17j012n75L11R00q21O58M9no30J09M0p7m1B302
$$ 1880 2392 1783 2446 1997 1931 1628 2376 2793 1781 1206 1517 2417 1596 2254 2303 2298 1668 1777 1817 1740 1699 2302
698277B628J00r32Q19n49k32J211p85M82j67k6J80k6r67J312M5M37m64N78j72C677
$$ 2628 2728 1796 2615 2066 1834 3045 2260 2742 2575 2549 2729 2703 1736 3048 3093 3530 3066 3644 3472 3677
678582B559M42n59K4L17r12j06Q64o95L06o1K16o35K01j12K06m99m84J232p10B499
$$ 2559 3001 2442 2466 2783 1871 1765 2629 1934 2240 2179 2395 1760 1961 1849 2055 1556 1072 2304 1594 2499
658703E97Q24m58k63P90R20o70j51O83p75n99Q54p15K82J20l02L62om48O69M0F92
$$ 597 1421 963 700 1490 2410 1740 1589 2272 1497 898 1752 1037 1319 1439 1137 1499 1493 1045 1714 1754 692
637673I53N08j97p1J61l77k6M48r21L02M32k97J46k16q56N64N58m02m5m0j11n0@
$$ 953 1461 1264 1193 1354 977 951 1399 478 780 1212 915 1061 845 -11 553 1111 709 664 624 513 463 0
615463A324q70Q6L37K92q0l27L43n58N04j00L57p9q0k36o5J42Q21j041L28O2j00A121
$$ 1324 454 540 877 1169 1089 762 1105 547 1051 951 1308 1229 1149 913 848 990 1811 770 1098 1160 1060 1121
593025A233O55k40o03M65k46J58l16L2q4k05N80l25J32J7L34L7j99l46M20P07A629
$$ 1233 1888 1648 1045 1510 1264 1422 1106 1138 1054 849 1429 1104 1236 1253 1587 1624 1425 1079 1499 2206 1629
571342A938k34l3k19L34k44n30O41l34M8R8P8j17m15N87p3J74n2j52Q99l99P18D507
$$ 1938 1704 1671 1452 1786 1542 1012 1653 1319 1367 1465 1543 1426 1011 1598 1525 1699 1647 1495 2394 1995 2713 4507
548440E839R25N055M683N060M200K747j601l186m131n757l860l391j465k048m78B411
$$ 5839 6764 11819 16502 21562 25762 28509 26908 23722 19591 13834 9974 6583 5118 3070 2592 2411
531358B592L97n0K92r26j61N24Q6L58k66k21q0J87JL23K53P7M74P36o73R7l25C958
$$ 2592 2989 2939 3231 2305 2144 2668 2754 3112 2846 2625 2545 2732 2733 3056 3309 3386 3860 4596 3923 4020 3695 3958
508038C507L14L29K7J93j18K7K74j08j78L64L00j38K8k64k2K15N31K10q7J4R9E229
$$ 3507 3821 4150 4177 4370 4252 4279 4553 4445 4267 4631 4931 4793 4821 4557 4535 4750 5281 5491 5404 5418 5517 5229
484471F505r87J101P4k22O78O89p81L0J56N17L87K47k1O65k67J192K17P20J21A2183
$$ 6505 5518 6619 6693 6471 7149 7838 7057 7087 7243 7760 8147 8394 8373 9038 8771 9963 10180 10900 11021 12183
462735A2501j66L58J339m4p0r60K33Q01M79n53p63J22j24R2o02n42r14j292p32H616
$$ 12501 12335 12693 14032 13988 13918 12958 13191 13992 14471 13918 13155 13277 13153 13245 12643 12101 11187 9895 9163 8616
440789G561J78n76r24K18n51M65n66L09P3l40N86J38j88N30m75lq7K59J23j23F891
$$ 7561 7739 7163 6239 6457 5906 6371 5805 6114 6187 5847 6433 6571 6383 6913 6438 6435 6348 6607 6730 6607 6891
417570G110J94M41P07K69n56L60J54j03J18J24J78J69n36Q18o16M70Q3L75o06I804
$$ 7110 7304 7745 8452 8721 8165 8525 8679 8576 8694 8818 8996 9165 8629 9447 8831 9301 9384 9759 9153 9804
395188I701j326O61K74j3j44l70l86Q67j004N60K7j116R78p08k66J52j35r0Q2G729
$$ 9701 8375 9036 9310 9297 9153 8783 8397 9264 8260 8820 8847 7731 8709 8001 7735 7887 7752 7662 7744 7729
372587G886K46o49J51k31oL02j57n6L56k63m7m44R04K75N26J416M90K463K723B0133
$$ 7886 8132 7483 7634 7403 7397 7699 7542 7486 7842 7579 7532 7088 7992 8267 8793 10209 10699 13162 15885 20133
349762B7143Q675J8003L1331O6947J54798K89266L11795R1781k09893l18932k07324A61030
$$ 27143 35818 53821 85152 152099 306897 596163 907958 999739 789846 470914 263590 161030
335522A14110k7268j8464j6088j0696q221o697n656l155l453j918j874j170k091G526
$$ 114110 86842 68378 52290 41594 33373 26676 21020 17865 14412 12494 10620 9450 7359 7526
318985E655r45L02m89L9j410J019j251J23l61j16K87k22j023K09K75K63k4p65A375
$$ 5655 4710 5012 4523 4562 3152 4171 2920 3043 2682 2566 2853 2631 1608 1817 2092 2355 2331 1566 1375
296754A338O17j023R57k25j86N63m34j59j23OJ21J00o76N51qk96K56o25O37P36C301
$$ 1338 1955 932 1889 1664 1478 2041 1607 1448 1325 1331 1452 1552 876 1427 1419 1123 1379 754 1391 2127 3301
272059B541P08r33j186R7o35N52N3n07m33O4k84Q31K92j62k09L44J81P53o32L43A622
$$ 2541 3249 2316 1130 1227 592 1144 1197 690 257 321 37 868 1160 998 789 1133 1314 2067 1435 1778 1622
247109A449N09L23L86J109J71P74L163K909N372N950M947L954M239L498j570l032B7515
$$ 1449 1958 2281 2667 3776 3947 4721 7884 10793 16165 22115 27062 31016 35255 38753 37183 34151 27515
226503A9645p273m201k900j543j288r04n73L76j196J122p23O80k08r40l14N80e8
$$ 19645 12372 8171 5271 3728 2440 1536 963 1339 143 1265 542 1222 1014 74 -240 340 -58
205722B96k32K7J11R3j16q3Q41q68k12M30N89N2j51N95J353n68K35O40M05P94D364
$$ 296 64 91 202 295 179 96 937 69 -143 287 876 928 777 1372 2725 2157 2392 3032 3437 4231 4364
180082D745N80J648P24J486P02J047J154P08J691M24J388J278N2J180N83J72m80A9498
$$ 4745 5325 6973 7697 9183 9885 10932 12086 12794 14485 14909 16297 17575 17627 18807 19390 19562 19082 19498
157723A8527k95j648M56k088n88k031m55j747j987j137p28q08k19j219m48L92C222
$$ 18527 18232 16584 17040 14952 14364 12333 11878 10131 8144 7007 6279 5471 5252 4033 3585 3977 3222
136354B488k85j085j70m85m66J090n26J225j471k94P27p8J019P22L24N70l46Q61D715
$$ 2488 2203 1118 948 463 -3 1087 561 1786 315 21 748 670 1689 2411 2735 3305 2959 3820 4715
112397D544RL56J894R02J349J399L013J049O382P044Q684J3960K5697L8142N1600B17815
$$ 4544 4553 4909 6803 7705 9054 10453 13466 14515 20897 27941 36625 50585 76282 114424 166024 217815
91853B52697K41l3607n4278n1386m2136k7597j4045j0555n823m044j772k163E450
$$ 252697 252938 219331 165053 113667 71531 43934 29889 19334 13511 9467 7695 5532 5450
74809C092k030O90j758P10K120B048
$$ 3092 1062 1752 -6 704 2824 2048
66244C050  $$checkpoint
##END=