##TITLE= Raman spectrum of Smaragdite � http://rdrs.uaic.ro
##MINERAL= Smaragdite
##CHEMISTRY= Ca2(Mg,Fe++)5Si8O22(OH)2
##JCAMP-DX= 5.01
##DATA TYPE= RAMAN SPECTRUM
##DATA CLASS= XYDATA
##ORIGIN= Department of Geology, UAIC, Romania
##OWNER= http://rdrs.uaic.ro � stud. Apopei Andrei Ionut
##LONGDATE= 2010/10/09 14:30:01.0388 +0200 $$ export date from JSpecView
##SPECTROGRAPHDATASYSTEM= HE 532 (Horiba Jobin-Yvon)
##XUNITS= Raman shift (1/cm)
##YUNITS= Intensity (cnt)
##XFACTOR= 3.188909E-3
##YFACTOR= 2.65783004E-3
##FIRSTX= 3399.61
##FIRSTY= -3.18311492
##LASTX= 210.701
##NPOINTS= 1024
##XYDATA= (X++(Y..Y))
1066073a198K426M62l402J331J367L015l44l433j056q43J361J72K037p86M021m578b696
$$ -1198 1228 1690 -1712 -381 986 4001 3657 224 -832 -1675 -314 -142 1895 1109 5130 552 -2696
1052118b09J260j505L147j202k501j674K081N131k711l014k464M440j92J122l170B309
$$ -209 1051 -454 2693 1491 -1010 -2684 -603 4528 1817 -1197 -3661 779 587 1709 -1461 2309
1038838D79J7j625q16J378j06K956j82k541M079m633J889J652k505K022R05j443G04
$$ 479 496 -1129 -1945 -567 -673 2283 2101 -440 3639 -994 895 2547 42 2064 2969 1526 704
1024673f39Q57L629r67o810K408Q68j874K691M45j702K635K698l130j022P65m757e58
$$ -639 218 3847 2880 -3930 -1522 -654 -2528 163 608 -1094 1541 4239 1109 87 852 -3905 -558
1010396A424o9R21k165K378L15K546m270J6j375p46j767K396r79K530R22K066L91A787
$$ 1424 1355 2276 111 2489 2804 5350 1080 1096 -279 -1025 -2792 -396 -1375 1155 2077 4143 4534 1787
995202f97Q03J632J957l933k459J390O58J028n3K823j124l318Q71o39J499K947A356
$$ -697 106 1738 3695 -238 -2697 -1307 -649 379 326 3149 2025 -1293 -422 -1061 438 3385 1356
980696B000o80o65J922L98J252j241J180J70p87k83m956J099k806L434L166P37A912
$$ 2000 1320 655 2577 2975 4227 2986 4166 4336 3549 3266 -1690 -591 -3397 37 3203 3940 1912
966073A516J149K189j222j330n809R13j833K645M361p82J93j209n49J358J759A559
$$ 1516 2665 4854 3632 2302 -3507 -2594 -4427 -1782 2579 1797 1990 781 232 1590 3349 1559
952160c50j940N001q81L0J050M46m222m72Q49r18J967L394l875k469L492O54m49A934
$$ -350 -2290 2711 1830 1860 2910 3356 -866 -1338 -489 -1407 560 3954 79 -2390 1102 1756 1307 1934
936486g92K569m601M703o03l962J153M52O59O25L773j735j822K12k075j333J129i67
$$ -792 1777 -2824 1879 1276 -2686 -1533 -1081 -422 203 3976 2241 419 631 -1444 -2777 -1648 -967
921516i40K226j519K793k375k148J778j263j061%J741J968p17J442j19j717l654b700
$$ -940 1286 -233 2560 185 -1963 -185 -1448 -2509 -2509 -768 1200 483 1925 1806 89 -3565 -2700
906429b758M434K122j712J739k949p4N50K49k22m391k44M790Lp85J915k321J136c61
$$ -2758 1676 3798 2086 3825 876 802 1352 1601 1379 -3012 -3256 1534 1537 752 2667 346 1482 -361
890377i97j94L422r62J248j004Q05m314J731p16N67L952n1q8j293o09l550K540B342
$$ -997 -1191 2231 1269 2517 1513 2318 -1996 -265 -981 -414 3538 3487 3399 2106 1497 -2053 487 2342
874189D356k108j340J090j374O14L76R94n029L050m53j989R69k195K617K808n177A325
$$ 4356 2248 908 1998 624 1238 1614 2608 -2421 629 176 -1813 -844 -3039 -422 2386 -2791 1325
858729A737J829r94k911j437J545L806J689k923J755j037l309m083M794K141k532F91
$$ 1737 3566 2572 -339 -1776 -231 3575 5264 2341 4096 3059 -250 -4333 461 2602 70 691
844013h77o94L210O8m01m17J572j659k797j700K699k251M286M27q81M57K200j037A745
$$ -877 -1571 1639 1707 1306 889 2461 802 -1995 -3695 -996 -3247 1039 1466 585 1042 3242 2205 1745
827437a192l07k476K202o17j956L58M839P38q17K391k080J87K067n033J387n20a013
$$ -1192 -1499 -3975 -1773 -2390 -4346 -3988 851 1589 772 3163 1083 1270 3337 -1696 -309 -829 -1013
811607A532k248k856L23P04O73J776L439p80j099l269q32N773j867O16j054K017C304
$$ 1532 -716 -3572 -3249 -2545 -1872 -96 3343 2563 1464 -1805 -2637 3136 1269 1885 831 2848 3304
795645i4J816k476J484l839K968K008N15K343k944l450m99J391r2K021n130J995f17
$$ -94 1722 -754 730 -3109 -141 1867 2382 4725 1781 -1669 -2168 -777 -869 1152 -3978 -1983 -617
779561B450l069K130o0m41M712n722K72O89k336K511l867J429R58J840P72l061B800
$$ 2450 -619 1511 1451 1010 5722 0 272 961 -1375 1136 -2731 -1302 -344 1496 2268 -793 2800
763346I07J265k867K291k79m92L501P70l249j701k414L273L206l291m22K452j438C284
$$ 907 2172 -695 1596 1317 825 4326 5096 1847 146 -2268 1005 4211 920 498 2950 1512 3284
747002B009k974Q41K049q93k041K010K71K506k823J553q90l099L88k56K929k522B359
$$ 2009 -965 -124 1925 1032 -1009 1001 1272 3778 955 2508 1618 -1481 -1093 -1349 1580 -942 2359
730526C375k555J360r22J412L93p39l076J740J528j033K743Q0o73j678q43j053A205
$$ 3375 820 2180 1258 2670 3063 2324 -752 988 2516 1483 4226 4306 3633 1955 1112 59 1205
713918G75J914Q22m661j548L618K058K33l326j112N468n312j44M271p67l576k644c436
$$ 775 2689 3511 -1150 -2698 920 2978 3211 -115 -1227 4241 -1071 -1215 3056 2289 -1287 -3931 -3436
697176D48o66J633k381k701L889l680J765k74J590p49m40K703J343j471M77O83E9
$$ 448 -218 1415 -966 -3667 222 -3458 -1693 -1967 -377 -1126 -1566 1137 2480 1009 1486 2169 59
680298B57q06M711n223K486l098k259K867lk395J094J778O96O43K1k733J004J52A494
$$ 257 -549 4162 -1061 1425 -1673 -3932 -1065 -1068 -3463 -2369 -591 105 748 769 -1964 -960 -808 1494
662336C646k335k994K592J323R29J05k245k379r98K413K397L061k064k364J026h02
$$ 3646 1311 -1683 909 2232 3161 3266 1021 -1358 -2356 57 2454 5515 3451 1087 2113 -802
646133e340L726l29L452j277K715j159p98O75K407j535J793l539j324J263k585A690
$$ -5340 -1614 -1943 1509 232 2947 1788 990 1665 4072 2537 4330 791 -533 730 -1855 1690
629808A140J366m781L47l91K902J222L695l173n357J917J588K705q24J881k911A981
$$ 1140 2506 -2275 -1928 -2319 583 1805 5500 2327 -3030 -1113 475 3180 2356 4237 1326 1981
613354a780k787O141J853j682J8J295j090j863P84j936J532k37k900L344k514a256
$$ -1780 -4567 1574 3427 1745 1763 3058 1968 105 889 -1047 485 248 -2652 692 -1822 -1256
596775f12n37J817j382K96L567j38l858R74k587M416k002p39P66k850L030l370B799
$$ -612 -1149 668 -714 -418 3149 3011 -847 127 -2460 1956 -46 -785 -19 -2869 161 -3209 2799
579082c08R53j694K801N31l589o58J383k837K043R40j419j986L688r07j934M685c042
$$ -308 645 -1049 1752 2283 -1306 -1964 -581 -3418 -1375 -435 -1854 -3840 -152 -1059 -2993 1692 -3042
561245c200o91J394M622J324n870K054P30R57q21J148k933L697m197L919j626e554
$$ -3200 -3891 -2497 2125 3449 -2421 -367 363 1320 499 1647 -1286 2411 -1786 2133 507 -5554
544265i45J539l660K395J364O32J406J549o519Q49J811j140L43J760L434l615D101
$$ -945 594 -3066 -671 693 1325 2731 4280 -2239 -1390 421 -719 -376 1384 4818 1203 4101
527152D145l942j916R64k32j344R68q91J741j794p43L420k710K74q6J065j08j490f59
$$ 4145 203 -1713 -749 -981 -2325 -1357 -2248 -507 -2301 -3044 376 -2334 -2060 -2146 -1081 -1189 -2679 -659
507870A551n1K102j293l358K432P78j957O68j733j655l14L993j715K314j720l949b266
$$ 1551 1500 3602 2309 -1049 1383 2161 204 872 -861 -2516 -2830 1163 -552 1762 42 -3907 -2266
489446b371N323m40k2o179O510l021M692k964J94l165n12L85J235K585k516L100A924
$$ -2371 2952 2512 2490 -3689 2821 -200 4492 1528 1722 -1443 -1955 -1570 -335 2250 -266 2834 1924
470870A687m756K252J607n713K875P62p42j927O008n2R22n919J476j646J07O673C293
$$ 1687 -3069 -817 790 -4923 -2048 -1286 -2028 -3955 2053 2001 2923 -2996 -1520 -3166 -3059 3614 3293
452142g27j186N19N455k886m32k699K747j133J289j291J419l573M037M88m773I58
$$ -727 -1913 -1394 4061 1175 743 -1956 791 -342 947 -344 1075 -2498 1539 2027 -2746 958
434312C127k663l189N071l811j331J826N65K647J082k510q14R21l56L209k861i79
$$ 3127 464 -2725 2346 -1465 -2796 -970 -405 2242 3324 814 0 921 565 3774 913 -979
416340A049j707r71L275J177j553m588L888J234k254j294r65L876J89K065n27A079
$$ 1049 -658 -1629 1646 2823 1270 -3318 570 1804 -450 -1744 -2709 1167 1356 3421 2894 1079
398230A037j149M99k287J386k400K839j771M380p81l02k372N52L963m012j141b075
$$ 1037 -112 387 -1900 -514 -2914 -75 -1846 2534 1753 1451 -921 -369 3594 -418 -1559 -2075
379973a834J386L615j77j46j330p59l035K483m02j366R74P42j102K07J975k060c79
$$ -1834 -448 3167 2990 2844 1514 755 -2280 203 -199 -1565 -591 151 -951 -744 1231 -829 -379
360490B549k397K44J280K367N504j646J816j523M103K687J341J940N700m145O025B8795
$$ 2549 152 396 1676 4043 9547 7901 9717 8194 12297 14984 16325 18265 23965 19820 25845 28795
341938C2429o21L367N597J0858J4779K9766K1697J9236J5876J7329O169j2769A44344
$$ 32429 31808 35175 40772 51630 66409 96175 117872 137108 152984 170313 176482 163713 144344
326547A27128q510N315J4320N763m578j5778j9035j1322p643j1502r199p458r297D4173
$$ 127128 118618 123933 138253 144016 139438 123660 104625 93303 85660 74158 64959 57501 48204 44173
309948D2820n237K548j548k182J466j986J693K171K996N975k81Q27L053M990J2017H7327
$$ 42820 37583 40131 38583 36401 37867 35881 37574 39745 42741 48716 48435 49262 52315 57305 69322 87327
290995I9823q287j1970j7721j1002o453o617k017r121k543j053l289j476r487A1881
$$ 99823 91536 79566 61845 50843 44390 37773 35756 26635 24092 23039 19750 18274 8787 11881
274146H169O73m165k011p82j586q07K119l49m4m547K985K98k94M680n516J03mc246
$$ 8169 8842 4677 2666 1884 298 -509 1610 1261 1217 -3330 -345 -47 -341 4339 -1177 -1074 -1078 -3246
252633b2K926l697r66O237j946k597P78K721K1N792K526L628P833N118R343R492D6206
$$ -22 2904 -793 -1759 4478 2532 -65 713 3434 3455 9247 11773 15401 23234 28352 37695 47187 46206
232075D7517l928l304o302l696j912J020J040R464O342J1320J8914K7306K8864A82591
$$ 47517 43589 40285 33983 30287 28375 29395 30435 39899 46241 57561 76475 103781 132645 182591
214810B63177J64503K38761K27334J00671j08934k31595k18596j38361q2539n5623A24804
$$ 263177 427680 666441 893775 994446 885512 653917 435321 296960 214421 158798 124804
200910I2227k8177k0444q372o203o202m028o212k126o789N33m207J940M114Q087A7122
$$ 92227 64050 43606 35234 29031 22829 18801 12589 10463 3674 4207 0 1940 6054 14141 17122
182254A7686M527Q94L223J430K471O269L475M141L846M775R87R844M743J0009G6052
$$ 17686 22213 23107 26330 27760 30231 36500 39975 44116 47962 52737 53724 63568 68311 78320 76052
163457G4679q724r327j5164p456j6200q039m818M110K585l016j691q66k861k07@
$$ 74679 65955 56628 41464 34008 17808 9769 4951 9061 11646 8630 6939 6073 3212 3005 0
144517E31K53n74Q996N432J3509J5086J1264R455J4154J7173J5530J5229l774A21899
$$ 531 784 210 9206 14638 28147 43233 54497 63952 78106 95279 110809 126038 122264 121899
126629A23904K1109K6437J7693K33j1312j4734J135J016n125j2013k7887k2344G7665
$$ 123904 145013 171450 189143 189376 178064 163330 164465 165481 160356 148343 120456 98112 77665
109818F4421j0319r591r603j2919l878m043p588o112M266L436P501J2952Q326C3222
$$ 64421 54102 44511 34908 21989 18111 14068 6480 368 4634 8070 15571 28523 36849 33222
91683C0903o749r052o573o296j066n09j175n3N059N346M373j4L688M642J4165F8338
$$ 30903 24154 15102 8529 2233 1167 658 -517 -570 4489 9835 14208 14194 17882 22524 36689 68338
70971I4470J1115j2400D9383
$$ 94470 105585 93185 49383
66073C49  $$checkpoint
##END=