##TITLE= Raman spectrum of Spodumene � http://rdrs.uaic.ro
##MINERAL= Spodumene
##CHEMISTRY= LiAlSi2O6
##JCAMP-DX= 5.01
##DATA TYPE= RAMAN SPECTRUM
##DATA CLASS= XYDATA
##ORIGIN= Department of Geology, UAIC, Romania
##OWNER= http://rdrs.uaic.ro � stud. Apopei Andrei Ionut
##LONGDATE= 2010/09/11 18:27:07.0343 +0300 $$ export date from JSpecView
##SPECTROGRAPHDATASYSTEM= HE 532 (Horiba Jobin-Yvon)
##XUNITS= Raman shift (1/cm)
##YUNITS= Intensity (cnt)
##XFACTOR= 3.188909E-3
##YFACTOR= 3.79874176E-4
##FIRSTX= 3399.61
##FIRSTY= 1.90095014
##LASTX= 210.701
##NPOINTS= 1024
##XYDATA= (X++(Y..Y))
1066073E004%%%%%%%%%%%%%%%%%%%%%%%%%%%%%%%%%%%%%%%%%%%%%%%%%%%%%%%%E004
$$ 5004 5004 5004 5004 5004 5004 5004 5004 5004 5004 5004 5004 5004 5004 5004 5004 5004 5004 5004 5004 5004 5004 5004 5004 5004 5004 5004 5004 5004 5004 5004 5004 5004 5004 5004 5004 5004 5004 5004 5004 5004 5004 5004 5004 5004 5004 5004 5004 5004 5004 5004 5004 5004 5004 5004 5004 5004 5004
1020716E004%%%%%%%%%%%%%%%%%%%%%%%%%%%%%%%%%%%%%%%%%%%%%%%%%%%%%%%%E004
$$ 5004 5004 5004 5004 5004 5004 5004 5004 5004 5004 5004 5004 5004 5004 5004 5004 5004 5004 5004 5004 5004 5004 5004 5004 5004 5004 5004 5004 5004 5004 5004 5004 5004 5004 5004 5004 5004 5004 5004 5004 5004 5004 5004 5004 5004 5004 5004 5004 5004 5004 5004 5004 5004 5004 5004 5004 5004 5004
974211E004%%%%%%%%%%%%%%%%%%%%%%%%%%%%%%%%%%%%%%%%%%%%%%%%%%%%%%%%E004
$$ 5004 5004 5004 5004 5004 5004 5004 5004 5004 5004 5004 5004 5004 5004 5004 5004 5004 5004 5004 5004 5004 5004 5004 5004 5004 5004 5004 5004 5004 5004 5004 5004 5004 5004 5004 5004 5004 5004 5004 5004 5004 5004 5004 5004 5004 5004 5004 5004 5004 5004 5004 5004 5004 5004 5004 5004 5004 5004
926521E004%%%%%%%%%%%%%%%%%%%%%%%%%%%%%%%%%%%%%%%%%%%%%%%%%%%%%%%%E004
$$ 5004 5004 5004 5004 5004 5004 5004 5004 5004 5004 5004 5004 5004 5004 5004 5004 5004 5004 5004 5004 5004 5004 5004 5004 5004 5004 5004 5004 5004 5004 5004 5004 5004 5004 5004 5004 5004 5004 5004 5004 5004 5004 5004 5004 5004 5004 5004 5004 5004 5004 5004 5004 5004 5004 5004 5004 5004 5004
877607E004%%%%%%%%%%%%%%%%%%%%%%%%%%%%%%%%%%%%%%%%%%%%%%%%%%%%%%%%B936
$$ 5004 5004 5004 5004 5004 5004 5004 5004 5004 5004 5004 5004 5004 5004 5004 5004 5004 5004 5004 5004 5004 5004 5004 5004 5004 5004 5004 5004 5004 5004 5004 5004 5004 5004 5004 5004 5004 5004 5004 5004 5004 5004 5004 5004 5004 5004 5004 5004 5004 5004 5004 5004 5004 5004 5004 5004 5004 2936
827437B936%%%%%%%%%%%%%%%%%%%%%%%%%%%%%%%%%%%%%%%%%%%%%%%%%%%%%%%%B936
$$ 2936 2936 2936 2936 2936 2936 2936 2936 2936 2936 2936 2936 2936 2936 2936 2936 2936 2936 2936 2936 2936 2936 2936 2936 2936 2936 2936 2936 2936 2936 2936 2936 2936 2936 2936 2936 2936 2936 2936 2936 2936 2936 2936 2936 2936 2936 2936 2936 2936 2936 2936 2936 2936 2936 2936 2936 2936 2936
775968B936%%%%%%%%%%%%%%%%%%%%%%%%%%%%%%%%%%%%%%%%%%%%%%%%%%%%%%%n83A709
$$ 2936 2936 2936 2936 2936 2936 2936 2936 2936 2936 2936 2936 2936 2936 2936 2936 2936 2936 2936 2936 2936 2936 2936 2936 2936 2936 2936 2936 2936 2936 2936 2936 2936 2936 2936 2936 2936 2936 2936 2936 2936 2936 2936 2936 2936 2936 2936 2936 2936 2936 2936 2936 2936 2936 2936 2936 2353 1709
723163A064j97%%%%%%%%%%%%%%%%%%%%%%%%%%%%%%%%%%%%%%%%%%%%%%%%%%%%%H67
$$ 1064 867 867 867 867 867 867 867 867 867 867 867 867 867 867 867 867 867 867 867 867 867 867 867 867 867 867 867 867 867 867 867 867 867 867 867 867 867 867 867 867 867 867 867 867 867 867 867 867 867 867 867 867 867 867 867
670863H67%%%%%%%%%%%%%%%%%%%%%%%%%%%%%%%%%%%%%%%%%%%%%%%%%%%%%%%%%H67
$$ 867 867 867 867 867 867 867 867 867 867 867 867 867 867 867 867 867 867 867 867 867 867 867 867 867 867 867 867 867 867 867 867 867 867 867 867 867 867 867 867 867 867 867 867 867 867 867 867 867 867 867 867 867 867 867 867 867 867 867
614326H67%%%%%%%%%%%%%%%%%%%%%%%%%%%%%%%%%%%%%%%%%%%%%%%%%%%%%%%%%H67
$$ 867 867 867 867 867 867 867 867 867 867 867 867 867 867 867 867 867 867 867 867 867 867 867 867 867 867 867 867 867 867 867 867 867 867 867 867 867 867 867 867 867 867 867 867 867 867 867 867 867 867 867 867 867 867 867 867 867 867 867
556265H67%%%%%%%%%%%%%%%%%%%%%%%%%%%%%%%%%%%%%%%%%%%%%%%%%%%%%%%%%H67
$$ 867 867 867 867 867 867 867 867 867 867 867 867 867 867 867 867 867 867 867 867 867 867 867 867 867 867 867 867 867 867 867 867 867 867 867 867 867 867 867 867 867 867 867 867 867 867 867 867 867 867 867 867 867 867 867 867 867 867 867
496628H67%%%%%%%%%%%%%%%%%%%%%%%%%%%%%%%%%%%%%%%%%%%%%%%%%%%%%%%%%H67
$$ 867 867 867 867 867 867 867 867 867 867 867 867 867 867 867 867 867 867 867 867 867 867 867 867 867 867 867 867 867 867 867 867 867 867 867 867 867 867 867 867 867 867 867 867 867 867 867 867 867 867 867 867 867 867 867 867 867 867 867
435365H67%%%%%%%%%%%%%%%%%Q57J212%%%%%%%%%%%%%%%%%%%%%%%%K24K50K51C911
$$ 867 867 867 867 867 867 867 867 867 867 867 867 867 867 867 867 867 867 1724 2936 2936 2936 2936 2936 2936 2936 2936 2936 2936 2936 2936 2936 2936 2936 2936 2936 2936 2936 2936 2936 2936 2936 2936 2936 3160 3410 3661 3911
384282D162K51K51K51K51K51K52K51K52K52K52K52K52K52K52K53K52K53K53K53I201
$$ 4162 4413 4664 4915 5166 5417 5669 5920 6172 6424 6676 6928 7180 7432 7684 7937 8189 8442 8695 8948 9201
361575A2430N70N70N71N71N71J753J905J906J907J908J907O66M3870K8347M0337A84540
$$ 12430 13000 13570 14141 14712 15283 17036 18941 20847 22754 24662 26569 27235 71105 99452 139789 184540
343033A75559k5229J0635O3074J19625K22251K25232M4224j42870k37615k10820A87409
$$ 175559 150330 160965 224039 343664 565915 791147 835371 692501 454886 244066 187409
329853A69421m7664k6350n822m5324L4732J1921N625N7878O6429P264n3263l9666A07279
$$ 169421 121757 95407 89585 44261 78993 90914 96539 154417 220846 228110 174847 135181 107279
314387E7921j7064o62j7097N028j2779%%%%%%%%%%%%%%%%%%%%%%%%%%%%%%%%%A5347
$$ 57921 40857 40195 23098 28126 15347 15347 15347 15347 15347 15347 15347 15347 15347 15347 15347 15347 15347 15347 15347 15347 15347 15347 15347 15347 15347 15347 15347 15347 15347 15347 15347 15347 15347 15347 15347 15347 15347 15347 15347
269633A5347%%%%%%%%%%%%%%K069%%%K8597N0319j620J6137n0255j8044K380j6233B6299
$$ 15347 15347 15347 15347 15347 15347 15347 15347 15347 15347 15347 15347 15347 15347 15347 17416 17416 17416 17416 46013 96332 94712 110849 60594 42550 44930 28697 26299
237803B3898j0619%O205l36j732%M141M820O4860J9608P9639K50200L13252K26544A000000
$$ 23898 13279 13279 19484 19148 17416 17416 21557 26377 91237 110845 190484 440684 753936 980480 1000000
219426G50950l24659k22780j20238l8241j3718j3406j213j348%%%%%%%%%%%M137A9484
$$ 750950 426291 203511 83273 45032 31314 17908 16695 15347 15347 15347 15347 15347 15347 15347 15347 15347 15347 15347 15347 19484 19484
193931B1553%L549K447K278%N998O3302K9113J3864J3022l6210k2860p6319j229A7277
$$ 21553 21553 25102 27549 29827 29827 35825 99127 128240 142104 155126 118916 96056 19737 18508 17277
175222A7416%%%%P948j743O5850Q1408Q3644K6025k7116p4358q4694m8944k7953A8635
$$ 17416 17416 17416 17416 17416 25364 23621 89471 170879 254523 280548 253432 179074 94380 45436 17483 18635
155188A4028k482l36%J010%%%J181%J1635J8309M6208K1913L7649K751k9432n2112D0762
$$ 14028 11546 11210 11210 12220 12220 12220 12220 13401 13401 25036 43345 89553 111466 149115 151866 122434 70322 40762
132606A3959J757q046K8696M3274R0100J36342J38875O2727k9926j06665j20875A61068
$$ 13959 15716 7670 36366 79640 169740 306082 444957 507684 477758 371093 250218 161068
117037A11957L6532J30417K49608K39922J15974r8256k59866k34720j58856m2381G5850
$$ 111957 148489 278906 528514 768436 884410 786154 526288 291568 132712 90331 75850
102580G3320%%j462m125Q7305J40616J62493N5232j9723j31012j24568j05986G7996
$$ 73320 73320 73320 71858 67733 155038 295654 458147 513379 493656 362644 238076 132090 77996
85608F8902K934J5742J4805J8025O658K5857j6519l3941l5445l3028j4410r89A8154
$$ 68902 71836 87578 102383 120408 127066 152923 136404 102463 67018 33990 19580 18591 18154
68523F894@
$$ 6894 0
66073@  $$checkpoint
##END=