##TITLE= Raman spectrum of Strontianite � http://rdrs.uaic.ro
##MINERAL= Strontianite
##CHEMISTRY= SrCO3
##JCAMP-DX= 5.01
##DATA TYPE= RAMAN SPECTRUM
##DATA CLASS= XYDATA
##ORIGIN= Department of Geology, UAIC, Romania
##OWNER= http://rdrs.uaic.ro � stud. Apopei Andrei Ionut
##LONGDATE= 2010/02/14 19:47:37.0396 +0200 $$ export date from JSpecView
##XUNITS= Raman shift (1/cm)
##YUNITS= Intensity (cnt)
##XFACTOR= 3.188909E-3
##YFACTOR= 1.63320232E-3
##FIRSTX= 3399.61
##FIRSTY= 0.00032023
##LASTX= 210.701
##NPOINTS= 1024
##XYDATA= (X++(Y..Y))
$$ plain form
1066073 0 8684 7802 1019 5003 6347 6167 10138 5626 6003 8000 7156 1526 5825 4374 5053 4393 5001 5517
1051341 11008 11066 8125 3945 5526 5524 6186 2767 3742 5726 7007 6319 4845 6676 4425 2620 5789 6848
1037270 7597 5623 6896 6016 1264 1737 6035 5321 6328 8041 9612 8310 11998 9518 7382 7119 4937
1023883 3670 10547 11213 5130 1909 3687 6280 5311 7127 9441 7236 9729 4627 3836 4188 5103 1869 2939
1009599 1537 1109 926 5021 5831 7842 4731 1086 0 4038 1630 5621 6806 6583 6505 5824 2563 3689
995202 440 1560 5231 8334 7028 7426 7364 2558 2206 1965 3226 5670 4704 7815 9057 9932 6876 10512
980696 6109 4994 7998 6677 6280 6605 11501 8165 8855 7249 6659 3983 8334 5250 1329 3923 7978
966889 9754 14927 13251 13924 15345 13086 15096 11901 9612 10763 9013 11465 9509 12936 6941 6413 7429
$$ packed form
1066073@Q684q82o783L984J344j80L971m512L77J997q44n630M299j451O79o60O08E517
1051341A1008N8k941m180J581kO62l419R75J984J281o88j474J831k251j805L169F848
1037270G597j974J273q80m752M73M298p14J007J713J571j302L688k480k136k63D937
1023883C670O877O66o083l221J778K593r69J816K314k205K493n102p91L52R15l234B939
1009599A537m28j83M095Q10K011l111l645j086M038k408L991J185k23p8o81l261C689
995202D40J120L671L103j306L98o2m806l52k41J261K444r66L111J242Q75l056A0512
980696F109j115L004j321l97L25M896l336O90j606n90k676M351l084l921K594G978
966889I754N173j676O73J421k259K010l195k289J151j750K452j956L427n995n28G429
$$ plain form
952981 9620 5466 7617 9443 6935 9249 9326 9814 11285 10400 13156 12206 17010 15081 17136 14833 11817 16785
938142 13746 12268 10161 10370 17069 14085 13022 11088 14378 12865 12937 13974 12832 14215 15338 10014 14468
924018 13698 15596 14098 15259 14954 14549 13766 16347 11994 15641 12287 16606 17161 15033 16687 11827 9390
909794 15942 14362 14568 14842 13640 16824 21341 19714 14129 18454 18010 21095 15126 14146 16764 19331 17782
895460 17625 13678 13010 12628 16899 12694 17351 10463 14157 15528 17134 16225 19081 17753 15620 11752 16328
881022 18690 12986 19649 18783 15646 19190 15432 13913 16971 17213 17915 15692 12873 14322 11646 15786 16698
866475 17971 21835 14270 21329 15189 14031 16511 12476 13589 17175 19404 17431 16968 20319 18422 15552
852683 17301 16426 16281 13922 15235 14368 20317 17681 14935 15946 13225 10605 9519 17496 13584 17863 14982
$$ packed form
952981I620m154K151J826k508K314P7M88J471q85K756r50M804j929K055k303l016A6785
938142A3746j478k107K09O699k984j063j934L290j513P2J037j142J383J123n324A4468
924018A3698J898j498J161l05m05p83K581m353L647l354M319N55k128J654m860I390
909794A5942j580K06K74j202L184M517j627n585M325m44L085n969r80K618K567A7782
895460A7625l947o68l82M271m205M657o888L694J371J606r09K856j328k133l868A6328
881022A8690n704O663q66l137L544l758j519L058K42P02k223k819J449k676M140A6698
866475A7971L864p565P059o140j158K480m035J113L586K229j973m63L351j897A5552
852683A7301q75j45k359J313q67N949k636k746J011k721k620j086P977l912M279A4982
$$ plain form
837923 17568 15399 16659 10851 14584 16615 18126 17147 13535 11959 12572 16002 18024 13689 19349 11308 14913
823053 14040 12623 10853 14138 14028 15242 9949 10551 13316 12341 16455 14817 12357 13779 17893 14007 13693
808069 10729 9912 12003 12443 9856 11343 13577 14863 10933 12915 14511 7445 10885 13126 7376 11260 11086
792973 6216 3141 10227 9633 10900 8697 7759 10845 9396 7762 1986 3337 1384 8084 3247 4421 8656
777764 6896 9463 7082 6060 3664 4595 2 2954 1085 6990 5616 6992 4613 4221 3409 4694 6198
762443 9261 9649 12050 9638 11142 6652 8098 8060 7931 8204 7806 8215 8732 8922 8526 9380 11249 16228 21116
745176 20823 13387 14176 12677 15790 12665 15729 20243 19258 16714 19084 18420 16700 13295 11140 15877 19978
729607 21649 17610 14914 16394 18830 12891 20302 19404 19261 15422 13395 16684 19882 20558 18526 19631 17031
$$ packed form
837923A7568k169J260n808L733K031J511r79l612j576O13L430K022m335N660q041A4913
823053A4040j417j770L285j10J214n293O02K765r75M114j638k460J422M114l886A3693
808069A0729q17K091M40k587J487K234J286l930J982J596p066L440K241n750L884A1086
792973F216l075P086n94J267k203r38L086j449j634n776J351j953O700m837J174H656
777764F896K567k381j022k396R31m593K952j869N905j374J376k379l92q12J285F198
762443I261L88K401k412J504m490J446l8j29K73l98M09N17J90l96Q54J869M979B1116
745176B0823p436P89j499L113l125L064M514r85k544K370o64j720l405k155M737A9978
729607B1649m039k696J480K436n939P411q98j43l839k027L289L198O76k032J105A7031
$$ plain form
713918 21433 18945 20909 20594 15761 14526 16227 16361 12145 14771 13307 16238 15205 11330 12312 13487 13574
698110 12715 16679 12016 10080 16328 14320 15943 17995 14457 10752 8777 3273 6046 12024 12059 9748 15689
682180 11143 12375 10902 7200 13024 17492 13024 15459 16328 18129 11715 12447 14020 11813 15193 14072 17624
666131 17664 16114 15178 14722 18109 17012 14031 21106 17694 13512 16745 16879 12738 12382 13881 12691 18237
649956 16658 14394 13433 15644 12088 14212 15232 11836 14069 7819 12095 12718 14769 15741 16356 11054 7659
633659 6170 4265 4224 3498 4679 3692 8476 7947 3364 6523 6230 -4 1211 2035 5252 1438 1333 2615
616267 5744 9683 6933 5336 4841 4676 5093 6613 8412 6199 6513 6269 10565 6949 11588 9656 9842 11448
598735 11615 10814 8516 15168 11553 12108 12307 10850 9372 14412 13260 18895 15320 14188 15718 13203 9442
$$ packed form
713918B1433k488J964l15m833j235J701J34m216K626j464K931j033l875R82J175A3574
698110A2715L964m663j936O248k008J623K052l538l705j975n504K773N978L5k311A5689
682180A1143J232j473l702N824M468m468K435Q69J801o414P32J573k207L380j121A7624
666131A7664j550r36m56L387j097k981P075l412m182L233J34m141l56J499j190A8237
649956A6658k264r61K211l556K124J020l396K233o250M276O23K051R72O15n302G659
633659F170j905m1p26J181r87M784n29m583L159k93o234J215Q24L217l814j05B615
616267E744L939k750j597m95j65M17J520J799k213L14k44M296l616M639j932J86A1448
598735A1615q01k298O652l615N55J99j457j478N040j152N635l575j132J530k515I442
$$ plain form
582042 13097 15877 16035 21329 19367 12956 10859 8263 12186 5306 9380 7145 7589 9713 7038 6262 7209
565222 4128 7657 10990 8894 14147 12395 10781 13121 10410 6663 3743 1975 3826 3903 7649 7559 6476
548272 4693 1883 3354 7848 4247 8800 7773 4554 6279 7152 5682 11285 8810 6650 7411 7171 9443
531191 12088 9489 10559 6845 13659 13954 15972 14297 11655 8664 7019 10377 16296 13583 18237 15936
514991 14796 17853 16807 13903 11029 10641 13369 9770 13010 13579 9407 12106 12311 17174 16448 16641 11758
497653 12136 12845 7052 9011 8777 5654 8766 5225 5645 5265 6549 10403 12417 12631 13471 10827 6283 3245
479145 5250 4131 5623 2668 631 2630 827 6087 1659 2995 4535 7069 7494 8275 6653 7140 2784
461525 6757 9711 6758 10197 9992 15953 20988 32641 39946 32313 19091 12857 16469 11533 7731 9760
$$ packed form
582042A3097K780J58N294j962o411k097k596L923o880M074k235M44K124k675p76G209
565222D128L529L333k096N253j752j614K340k711l747k920j768J851P7L746r0F476
548272D693k810J471M494l601M553j027l219J725Q73j470N603k475k160P61k40I443
531191A2088k599J070l714O814K95K018j675k642k991j645L358N919k713M654A5936
514991A4796L057j046k904k874l88K728l599L240N69m172K699K05M863p26J93A1758
497653A2136P09n793J959k34l123L112l541M20l80J284L854K014K14Q40k644m544C245
479145E250j119J492k955k037J999j803N260m428J336J540K534M25P81j622M87B784
461525F757K954k953L439k05N961N035J1653P305p633j3222o234L612m936l802I760
$$ plain form
444817 8791 8478 7892 4735 5212 4283 4388 7288 4061 3362 5021 4889 2101 3743 3417 -158 670 1945 154
424816 5936 33 1393 693 1596 2217 3687 5938 2020 3706 4169 5347 4951 6962 4188 3605 10048 6784
405706 8838 8328 6804 7806 7484 9965 10333 7735 6655 12041 12247 7817 10137 8711 7001 11831 9694
387509 14174 10445 10038 8432 13266 12760 9093 6407 6271 5523 2880 6224 8326 6531 5842 4364 -31
369170 3916 485 1790 4689 5004 7013 3520 6476 1456 1911 2844 4530 5511 7178 4368 6922 3774
350684 3493 5147 3689 5215 9171 12136 11184 11421 9972 13468 21096 106957 551870 999415 999842 504982
333155 113175 29383 19229 19755 18963 18034 17732 13605 14447 13132 8687 10880 16316 8451 9220 9374 12285
314387 11755 10811 8699 6836 6957 8912 9237 8117 9040 10279 5788 4488 5685 10776 9744 9405 11176
$$ packed form
444817H791l13n86l157M77r29J05K900l227o99J659j32k788J642l26l575Q28J275A54
424816E936n903J360p00R03O21J470K251l918J686M63J178l96K011k774n83O443F784
405706H838n10j524J002l22K481L68k598j080N386K06m430K320j426j710M830I694
387509A4174l729m07j606M834n06l667k686j36p48k643L344K102j795o89j478c1
369170C916l431J305K899L15K009l493K956n020M55R33J686R81J667k810K554C774
350684C493J654j458J526L956K965r52K37j449L496P628Q5861M44913M47545M27E04982
333155A13175q3792j0154N26p92r29l02m127Q42j315m445K193N436p865P69J54A2285
314387A1755r44k112j863J21J955L25j120R23J239m491j300J197N091j032l39A1176
$$ plain form
295468 9866 9820 7984 10362 14146 18412 15348 11911 13519 12725 19189 19881 15195 16660 17468 19849 17582 17055
275273 18102 19899 21526 20072 17508 18564 18349 20186 20687 17713 18735 15923 19102 15865 18032 16809 18912
256042 22655 20559 17983 18633 18164 20686 20363 18571 19819 19480 20648 19970 21594 21465 20998 20294 22439 20507
235514 22565 24252 19423 17175 21985 22669 22044 19331 26015 22227 28147 41855 56134 79778 103296 95381
217119 60694 35106 23670 19983 18963 17851 19022 20110 18315 14518 18227 17529 14979 18771 21543 17971
198586 19818 21477 16808 19463 20135 17987 18886 19379 17615 14556 16323 11960 14880 14479 15585 10888 11448
178740 9726 8356 7490 10900 8325 5600 7127 4825 3481 4882 3091 666 5145 4188 1877 594 3894
158735 2011 1425 125 3235 4801 6392 5125 5904 6048 5171 373 -147 2918 2381 4205 5565 3049 4748
$$ packed form
295468I866m6j836K378L784M266l064l437J608p94O464O92m686J465Q08K381k267A7055
275273A8102J797J627j454k564J056k15J837N01k974J022k812L179l237K167j223A8912
256042B2655k096k576O50m69K522l23j792J248l39J168o78J624j29m67p04K145B0507
235514B2565J687m829k248M810O84o25k713O684l788N920J3708J4279K3644K3518I5381
217119F0694k5588j1436l687j020j112J171J088j795l797L709o98k550L792K772A7971
198586A9818J659m669K655O72k148Q99M93j764l059J767m363K920m01J106m697A1448
178740I726j370q66L410k575k725J527k302j344J401j791k425M479r57k311j283C894
158735B011n86j300L110J566J591j267P79J44q77m798n20L065n37J824J360k516D748
$$ plain form
137377 5197 3716 5665 3674 3772 3234 4819 4413 3558 3420 2600 4024 785 2827 602 2334 2123 27
115835 2201 2133 2857 3637 3190 907 2285 4202 3881 3597 3944 2542 7560 7729 7813 7562 8191 11379 11434 12984
91683 14389 15741 18482 17980 21654 27282 32059 38684 42161 50123 58948 75646 87316 96985 90276 77049
72194 67928 57659 54568 59690 63664
$$ packed form
137377E197j481J949j991R8n38J585m06q55j38q20J424l239K042k225J732k11B7
115835B201o8P24P80m47k283J378J917l21k84L47j402N018J69Q4k51O29L188N5A2984
91683A4389J352K741n02L674N628M777O625L477P962Q825J6698J1670R669o709G7049
72194F7928j0269l091N122F3664
66073F5894  $$checkpoint
##END=