##TITLE= Raman spectrum of Sulfur � http://rdrs.uaic.ro
##MINERAL= Sulfur
##CHEMISTRY= S
##JCAMP-DX= 5.01
##DATA TYPE= RAMAN SPECTRUM
##DATA CLASS= XYDATA
##ORIGIN= Department of Geology, UAIC, Romania
##OWNER= http://rdrs.uaic.ro � stud. Apopei Andrei Ionut
##LONGDATE= 2012/11/12 22:53:39.0270 +0200 $$ export date from JSpecView
##XUNITS= Raman shift (1/cm)
##YUNITS= Intensity (cnt)
##XFACTOR= 3.188736E-3
##YFACTOR= 1.24321833E-2
##FIRSTX= 3399.97
##FIRSTY= 336.77353273
##LASTX= 211.234
##NPOINTS= 1024
##XYDATA= (X++(Y..Y))
1066244B7089N61K72j3J8K93o2N9k73q8p5k37j12K20n0J09Q7j18L5p9M5P7j59M36B7980
1046832B8013p3J66K79n3j41lp9K22l3J48p5k98R3j66K31LQ7j86j13J05J51l35B8237
1027997B8525r3L4J59k04n7J79P5m0j89L63k88N4K11k42M70j36j04j5j51M25l16B8411
1009767B8734j56L1N5l1L7k03K82o8p9J62J08K2j65M87J00M0j15J2k44J9Q8QJ34B9123
989743B8994j15L12q4j50M40l76jJ16Q5r7J65j12J35n1L26M3K11j8j36K08l07B9807
971128B9501k90K11J68M8k16p5j70L6L47k01rj10K00K19k33L42j83j2j75J13J95B9748
952327B9561K86q1m08Q61m64K76l90K8l4N1n9j79L46J31m08J27k49L89k45K7j24B9550
933335B9548Q1M6p2j18j61J72L79J10l1j49j19j91L54J3p5l2m73oJ06J81j14m4B9297
$$ plain form
1066244 27089 27650 27922 27909 27927 28220 28158 28217 27944 27856 27781 27544 27432 27652 27602 27711 27798 27680 27715 27636 27681 27758 27599 28035 27980
1046832 28013 27940 28106 28385 28332 28191 28188 28109 28331 28298 28446 28371 28073 28166 28000 28231 28234 28321 28135 28022 28127 28278 27943 28237
1027997 28525 28432 28466 28625 28421 28364 28543 28618 28578 28389 28752 28464 28518 28729 28487 28957 28821 28717 28702 28551 28976 28660 28411
1009767 28734 28578 28609 28664 28633 28670 28467 28749 28681 28602 28764 28872 28894 28729 29216 29316 29356 29241 29253 29009 29028 29116 29124 29258 29123
989743 28994 28879 29191 29107 28957 29397 29021 29020 29136 29221 29124 29289 29177 29312 29261 29587 29630 29841 29823 29687 29895 29588 29807
971128 29501 29211 29422 29590 29638 29422 29347 29177 29213 29560 29359 29350 29240 29440 29659 29426 29768 29585 29573 29398 29511 29706 29748
952327 29561 29847 29766 29358 30219 29755 30031 29641 29669 29635 29686 29627 29448 29794 29925 29517 29644 29395 29784 29539 29566 29442 29550
933335 29548 29629 29675 29603 29485 29324 29496 29875 29985 29954 29805 29686 29495 29849 29862 29787 29755 29282 29276 29382 29563 29449 29405 29297
913318B9408o6K4k12J35j59N44j17p3J85J03j08Q9m10K90k04k14Q9p1L33J28L9B9664
893934B9522j17R6K49m36M0J60j9n8M35l11k49l7J49Q4k30J39J96m3q2L05m3k67B9314
873500B9352k08J06K63j59K31l06k60J36K53N2mj23k39J29J73L5R1J1j4j27j19B9465
853714B9558k35o6k51Q2J50k45k46J21k77L89l9L7J68k63L40k15J77k9J70l17B9361
834600B9371j24Qj68j09N5k61J79q3J17j8k1M8j38k27K99j13P7Q8K15k52j56J18B8910
813539B9011j19l93M66M6k2k29Kj9k27l7j80L33L16l77k57K62j12j38R2K24j32B8507
793142B8622j1j61jr4K64j73o2j24j33k79L67q0lk6J22Q9k51j42J55J33l60L05B8083
771638B7702K25M73j02J16J53K7r5N6J97j97l97n7L93n77L30p8k93Rm4Q5J31J03B8175
$$ plain form
913318 29408 29342 29366 29154 29289 29130 29674 29557 29484 29669 29772 29664 29753 29343 29633 29429 29215 29304 29233 29566 29694 29733 29664
893934 29522 29405 29501 29750 29314 29354 29514 29495 29437 29872 29561 29312 29275 29424 29508 29278 29417 29613 29570 29488 29793 29750 29483 29314
873500 29352 29144 29250 29513 29354 29585 29279 29019 29155 29408 29460 29456 29333 29094 29223 29396 29431 29522 29533 29519 29392 29273 29465
853714 29558 29323 29257 29006 29088 29238 28993 28747 28868 28591 28980 28941 28978 29146 28883 29223 29008 29185 29156 29326 29009 29361
834600 29371 29247 29255 29087 28978 29033 28772 28951 28868 28985 28967 28946 28994 28856 28629 28928 28815 28892 28980 29195 28943 28787 28905 28910
813539 29011 28892 28499 28965 29011 28989 28760 28762 28743 28516 28479 28299 28632 28948 28571 28314 28576 28464 28326 28418 28642 28510 28507
793142 28622 28611 28450 28449 28355 28619 28446 28384 28260 28127 27848 28215 28135 28132 28106 28228 28317 28066 27924 28079 28212 27852 28157 28083
771638 27702 27927 28400 28298 28414 28567 28594 28499 28555 28752 28555 28158 28101 28494 27917 28247 28169 27876 27885 27841 27926 28057 28160 28175
749902B8137k01J94J27n2qQ1Q5Q8q3K14Kn3k98J06j96k9O4K58j20J70o4M5k27B8346
727015B7943K48l5k1kN0r6J95j42MJ08o3P0r8n2k2l62M8J63J76o2J45j69o2k70B7687
702940B7573K23q6J89Nj06j8q4K37Q4j67k40Q8L4J25j99k32o9jk58R3R8k41K13B7127
679523B7139L45k31M27M1k48J39n2J2L81j29j06Prp7l13L99n9R3l0k58Q1M2j30B7390
655846B7481N5J62j95J13J09J90m64J67k3k85K86L8q4o4M1j43k51j73K62q6Oj91B7336
632865B7001n7O7k19k6N61j59k08K91k81k00J08k62K12j10K19k31j56l23M60R9B6665
611578B6838m0M1j40k4lr8K37j15R2J22o5j4q0j75j06K2J34J75j88l9N7L08m24B6871
587132B6760j93J31k43K05N7j96K51p1j41l19k14n0K94k62l2m83l5l5K46J18J17B5900
$$ plain form
749902 28137 27936 28130 28257 28205 28197 28278 28363 28451 28368 28582 28584 28531 28233 28339 28143 28114 28178 28436 28316 28486 28422 28467 28240 28346
727015 27943 28191 28156 28135 28133 28183 28087 28282 28140 28144 28252 28189 28259 28161 28109 28087 27725 27773 27936 28112 28050 28195 28026 27964 27694 27687
702940 27573 27796 27710 27899 27904 27798 27780 27696 27933 28017 27850 27610 27698 27732 27857 27658 27426 27357 27356 27098 27191 27289 27048 27261 27127
679523 27139 27484 27253 27680 27721 27473 27612 27560 27572 27953 27824 27718 27725 27716 27639 27326 27725 27666 27759 27729 27471 27552 27594 27464 27390
655846 27481 27536 27698 27503 27616 27725 27915 27451 27618 27595 27310 27596 27634 27550 27486 27527 27384 27133 26960 27222 27136 27142 26951 27336
632865 27001 26944 27011 26792 26766 27327 27168 26960 27251 26970 26770 26878 26616 26828 26718 26937 26706 26550 26227 26687 26786 26665
611578 26838 26798 26839 26699 26675 26672 26574 26811 26696 26788 26910 26845 26831 26751 26576 26470 26492 26626 26801 26613 26574 26631 26939 26515 26871
587132 26760 26567 26698 26455 26660 26717 26521 26772 26701 26560 26241 26027 25977 26271 26009 25977 25494 25459 25424 25670 25788 25905 25900
564396B6018m65J96m1Q1q1K29l52K7N19l79n4j71o1J75k95n2J48J80k38k36n4B5286
541421B5020n8L18j80K63kK29r3J02j31P3j26J40k10R8j48o3J9J28j93K8N1j10B5191
517192B5140r0Q6l0N8k18j38l3j5L9Q5k35J08j97K6m2j31j20j82J10K8j92p6k4B3943
491668B3872k3r1P0R4J9k19L9k49L93l03j28Q1J11oj11j77K03P2k43o8pJ00J77B3507
465852B3365J66j47l0L06j9l1q9j53j62J71o4j87J0k20J79P7j50P8k06o6l1j11B2963
440789B2955j99q7pQ2j03j26M5k91k6J62l65o4M3N2p7j67K83k02K85k60Q4R5J1B1881
414387B2102j63J94k59l4r0j10L97k82k36r1R9PQ5j66K39J25o2j82J28k37L34B1651
389825B1413l4K62j94L6l64K13j03k9q1j03j40o2K8K88k21J5O0j5l3j69K5L0q3B0682
$$ plain form
564396 26018 25553 25749 25708 25789 25708 25937 25585 25612 26131 25752 25698 25527 25466 25641 25346 25294 25442 25622 25384 25148 25094 25286
541421 25020 24962 25280 25100 25363 25361 25590 25497 25599 25468 25541 25415 25555 25345 25443 25295 25232 25251 25379 25186 25214 25265 25155 25191
517192 25140 25050 25136 25106 25164 24946 24808 24775 24760 24799 24884 24649 24757 24560 24586 24544 24413 24293 24111 24221 24249 24057 23981 23957 23943
491668 23872 23849 23758 23828 23922 23941 23722 23761 23512 23905 23602 23474 23555 23666 23660 23549 23372 23575 23647 23404 23336 23329 23429 23606 23507
465852 23365 23531 23384 23354 23660 23641 23610 23521 23368 23206 23377 23313 23126 23136 22916 23095 23172 23022 23100 22894 22828 22797 22686 22963
440789 22955 22756 22669 22662 22744 22641 22515 22560 22269 22243 22405 22040 21976 22019 22071 21994 21827 22110 21908 22193 21933 22017 22112 22123 21881
414387 22102 21939 22133 21874 21840 21750 21640 22037 21755 21519 21428 21527 21534 21619 21453 21692 21817 21755 21573 21701 21464 21798 21651
389825 21413 21379 21641 21447 21483 21119 21332 21229 21200 21119 21016 20876 20814 20842 21130 20909 20924 20984 20969 20936 20767 20792 20822 20739 20682
362830B0606j33J08l11L6oL3rJ73k39r4J36k6J81L8Kj41K11j75L2J64k41K04l63B0132
335522B0399k6j03P0j33K28j38p8Q9M6Rk98K61m35J40j14O3n7k7j17L00k12j31A9520
309006A9738O5L9J22n3L03k0K56j57M99L33Q12J108Q54M90J43n94r65r46k38k9B2229
284438B2651M93J48K85M98J584K792L026K650J398N35n88j028j439k193j323j155B7700
264149B6958m15k85J92J304O85M99r39j802j960j208j237p24m70l72j03l65pj22A9647
241403A9512Q1j77k8J1N5KK34l38P2J14j40m1K98J66K75r7j34J16l66M16O5L32B0679
213825B0589j04J61j68M38L45J48j69l30k57l97r6N5K28J29L26L45m94l38l15A9763
189436A9529l5J52k02J27k2j93L51o7J50M46R63P96R03N63K4K6l93L33N81Q47B5890
$$ plain form
362830 20606 20473 20581 20270 20306 20300 20333 20324 20497 20258 20164 20300 20274 20455 20493 20495 20354 20565 20390 20422 20586 20345 20549 20186 20132
335522 20399 20373 20270 20340 20207 20435 20297 20219 20308 20354 20363 20065 20326 19891 20031 19917 19980 19923 19896 19779 20079 19867 19736 19520
309006 19738 19803 19842 19964 19911 20214 20194 20450 20293 20792 21125 21937 23045 23899 24389 24532 23938 22973 22027 21789 21760 22229
284438 22651 23144 23292 23577 24075 25659 28451 31477 34127 35525 36060 35472 34444 33005 30812 29489 28334 27700
264149 26958 26543 26258 26450 27754 28439 28938 27999 26197 24237 23029 21792 21068 20598 20226 20123 19758 19751 19629 19647
241403 19512 19593 19416 19388 19399 19454 19456 19690 19352 19424 19538 19398 19357 19655 19821 20096 19999 19865 19981 19615 20031 20096 20428 20679
213825 20589 20485 20646 20478 20916 21261 21409 21240 20910 20653 20256 20160 20215 20443 20572 20898 21243 20749 20411 20096 19763
189436 19529 19494 19646 19444 19571 19549 19356 19707 19640 19790 20236 21199 21995 22898 23461 23485 23511 23118 23451 24032 24879 25890
163627B6595R25J108J947K794M392O974J2842L1167R9134K25868L08523K50800A017892
147062H15302k97966k45966j39966n1769J585L0279L7476K1451m042k3164k9312H7980
131581F8308j2838r286o550n507l676j868p62n76j001q25j152j029j320j201r37A8895
111193A8381k45k44L17M66K37R44O19N16O11J29m9J92o8n47m74l55l86m9J03K14B0087
84562B0536M39K806Q712J3612J3461P036k95j483J1924J12763K69774L04215I09058
67469G72085D94133
$$ plain form
163627 26595 27520 28628 30575 33369 37761 44735 57577 88744 187878 413746 722269 973069 1017892
147062 815302 517336 271370 131404 79635 81220 111499 148975 170426 166384 143220 113908 87980
131581 68308 55470 46184 39634 34127 30451 28583 27821 27245 26244 25419 24267 23238 21918 20717 19780 18895
111193 18381 18136 17892 18209 18675 18912 19856 20475 20991 21602 21731 21682 21874 21806 21259 20785 20430 20044 19995 20098 20312 20087
84562 20536 20975 23781 32493 46105 59566 66602 66307 64824 76748 189511 459285 763500 909058
67469 772085 494133
##END=