##TITLE= Raman spectrum of Syngenite � http://rdrs.uaic.ro
##MINERAL= Syngenite
##CHEMISTRY= K2Ca(SO4)2*(H2O) 
##JCAMP-DX= 5.01
##DATA TYPE= RAMAN SPECTRUM
##DATA CLASS= XYDATA
##ORIGIN= Department of Geology, UAIC, Romania
##OWNER= http://rdrs.uaic.ro � stud. Apopei Andrei Ionut
##LONGDATE= 2009/11/08 19:08:20.0680 +0200 $$ export date from JSpecView
##XUNITS= Raman shift (1/cm)
##YUNITS= Intensity (cnt)
##XFACTOR= 3.188736E-3
##YFACTOR= 4.63161424E-3
##FIRSTX= 3399.97
##FIRSTY= -0.0081054
##LASTX= 211.234
##NPOINTS= 1024
##XYDATA= (X++(Y..Y))
1066244bO893J838K376L714J522q73J216K910J164J364P31o9K927L41J782j192B6962
1052288C0458M342l27K632J410L743L058N427O68M882L112L994O392N971N960O072I1095
1039007I5142O06J449R39p87k820J575k748l500n444l484l545m711l177k858k782F0584
1025629E4987l748N72k168l565l283k818l696K80k426k241O82k180k487j184l529B1638
1012153A9626l328J112l30n054n06q57K349k146O33l094K10o11j88k25j716l53F831
997778F220P68q10k033p67K132p62J144M05l278J378L55Q30m5k149n83k04M92B554
982480C669j781M43k335O46K360N1L311Q34j713J413p50N9j289j911j30j474m12A243
967057E6K484J287P06r60j213M29J196K39M24J567k548j482Q31j012N88k378k69A309
$$ y = [-2, 6891, 8729, 11105, 14819, 16341, 15468, 16684, 19594, 20758, 22122, 22853, 22784, 25711, 26052, 27834, 26642, 26962, 30458, 34800, 34473, 37105, 38515, 42258, 45316, 50743, 51411, 56293, 59405, 63399, 69791, 75762, 81722, 87794, 91095, 95142, 95748, 97197, 98136, 97349, 94529, 96104, 93356, 89856, 84412, 80928, 77383, 72672, 69495, 66637, 63855, 60584, 54987, 51239, 51811, 49643, 46078, 42795, 39977, 36281, 36561, 34135, 31894, 32576, 30396, 27909, 26725, 23196, 21638, 19626, 16298, 17410, 17080, 12026, 11520, 10663, 13012, 10866, 11499, 8405, 8615, 8004, 7816, 7591, 5875, 5522, 6831, 6220, 6988, 6178, 4145, 3378, 5510, 4748, 5892, 6297, 3019, 4397, 4752, 5582, 5537, 3388, 2805, 2601, 3093, 2554, 3669, 1888, 2331, -4, 642, 3002, 3053, 6364, 7198, 5485, 6898, 6148, 6207, 4918, 3007, 2877, 1403, 991, 1243, 56, 2540, 3827, 4533, 3573, 2360, 2789, 3985, 4224, 4648, 6215, 3667, 2185, 3016, 2004, 2592, 214, -55, 1309]
951506C257J25J335J69k78j115j157J479p29Q70N75N97M78k052p88J818j122K28C203
935825C543J891R02J737k143j994o47J882j80N90J609j097O54m14K79j414j34F057
920851G041n20j37O3J484j885J476j382o91n15o73N73k085K038j982J826K521G240
905757G445O32k887J5j48J293K061j305j554J233K908j4L67J054m81j06J02P20A0566
889694A0077j202M79j275j02j53Q34M71K757j239N82k251J363l40o25J935j540A0880
874356I974r18q27P51J001L66k737M26j080K772Q71J470l225n27r74l65R44K688A0938
858033A1153j305p32J095Q31q66M66O05j139m366L957O15R5k87q32j381j844J045H445
841572H520J189r49r34j053M050l398n71K707K592J110k272l227K76j096K17J491A0111
$$ y = [3257, 3382, 4717, 4886, 4608, 3493, 2336, 3815, 3086, 3956, 4531, 5128, 5606, 3554, 2766, 4584, 3462, 3690, 3203, 3543, 5434, 6336, 8073, 5930, 3936, 3289, 5171, 4991, 5581, 7190, 6093, 6747, 6333, 6612, 5198, 5064, 6057, 7041, 6521, 6384, 6447, 7931, 6046, 7522, 6140, 5449, 4934, 4261, 4834, 2749, 4787, 2805, 4631, 7152, 7240, 7445, 8077, 5190, 5205, 5057, 6350, 8411, 7106, 5552, 6785, 9693, 9679, 10046, 11100, 10619, 10513, 10615, 11335, 10566, 10077, 8875, 9354, 8079, 7977, 7824, 8658, 9129, 11886, 10647, 11229, 8978, 10341, 10001, 9376, 11311, 9771, 10880, 9974, 9056, 8229, 8980, 9981, 10347, 7610, 8036, 6956, 9728, 10599, 12069, 8844, 8317, 7343, 6978, 7922, 10610, 10938, 11153, 9848, 9116, 10211, 11042, 10176, 10642, 11247, 10108, 5742, 9699, 10314, 10409, 10122, 9290, 7909, 6065, 7110, 8445, 8520, 9709, 8760, 7826, 6773, 10823, 7425, 6854, 9561, 12153, 13263, 10991, 7764, 8040, 6944, 7161, 8652, 10111]
825851A0664k654J893o67L14N21j883o14P16J063k551j977J358K511j666k278G232
810889G095q58J400N94j686k34k25j581J511J449l065j084J533J519j086L24Q0F254
794923D303R50l656J44M585O02j229m97j453P94k094j671J496k16L00O40O47J27A939
777932E127j479j515k75P16n01l85j024o53M193O1K170M82Q82l41R48j95j781D743
760800E527l37J637l47j505q47j252K924k71J072K758k542k59J383J852j196j908E933
744433F511r76K585j767J951P64N93k610K777r44o76K343m50J482j441P22k264A0687
727934I305J282J89l09J094n02n44n82R12p21p79M08j374J499J283k1J84j323H195
710376H037K264J258j289J060j094K263k059o28r17L44J128j616r82J328j206F431
$$ y = [10664, 8010, 9903, 9236, 9550, 10071, 8188, 7574, 8290, 9353, 6802, 4825, 6183, 8694, 7028, 4750, 7232, 7095, 6237, 7637, 8231, 6545, 6311, 6086, 4505, 6016, 7465, 4400, 3316, 4849, 6368, 5282, 5606, 5686, 6254, 4303, 5253, 1597, 1741, 6326, 6928, 5699, 5202, 3749, 4543, 2449, 778, 2274, 2058, 2358, 2998, 3645, 3772, 1939, 5127, 3648, 2133, 1858, 2574, 2073, 1688, 664, 11, 4204, 4265, 6435, 6917, 7799, 7458, 8406, 8211, 6430, 4743, 5527, 5190, 6827, 6480, 4975, 4128, 2876, 5800, 5529, 6601, 9359, 6817, 6558, 7941, 9793, 8597, 6689, 5933, 6511, 5535, 8120, 6353, 8304, 9068, 9661, 7051, 9828, 8884, 8208, 10551, 10101, 11583, 10142, 10864, 8600, 10687, 9305, 10587, 10776, 10467, 11561, 11059, 10515, 9933, 10845, 10124, 9345, 9753, 8379, 9878, 11161, 11140, 11324, 10001, 8195, 8037, 10301, 11559, 10270, 11330, 10236, 12499, 10440, 9812, 8895, 9239, 10367, 8751, 7769, 9097, 7891, 6431]
694539D745K242K374k063l81j046M139l298k049n01K312j459J361J016J091J094I385
678582A0171j05m20K5j310K157P8M24J34p98p59K602j805k723K113J553L81J96A2837
660603I835j907k02J90K01j9L37j93k39J339N01k391J033q48Q75k420J354K355G567
642471H025r9J460k129L73M02m43j587l47N36n68j249J51l43l27mo22k169L683B033
623216C408l419P84m02J447J006M04L73J112j152O51J608o50k30k11j537J061C843
605735E487J285J87k96j61j732K275n72J241Q74o68k58J556j286L200l485J829H664
588114H873J882k634O02Q08k714L744n65Q80k075l76r48K084o31j340P0J388m563D758
569360F186q21k33j226K691L30p11n10j314q49L011l90r54o74J589j478Q15J124G100
$$ y = [4745, 6987, 9361, 7298, 6917, 5871, 10010, 6712, 4663, 4162, 6474, 5015, 6376, 7392, 8483, 9577, 9385, 10171, 10066, 9646, 9671, 8361, 10518, 10596, 11020, 11154, 10356, 9597, 12199, 10394, 7671, 9784, 11337, 11718, 11914, 12837, 9835, 7928, 7726, 7916, 8117, 8098, 8435, 8242, 8003, 9342, 9843, 7452, 8485, 7637, 8512, 6092, 7446, 9801, 7567, 8025, 7926, 9386, 7257, 7630, 8032, 7589, 6002, 5655, 6191, 5623, 4374, 4525, 4182, 3855, 3851, 3229, 1060, 4743, 2033, 3408, -11, 773, 371, 1818, 2824, 3228, 3601, 4713, 3561, 4212, 5820, 5170, 4940, 4729, 3192, 4253, 3843, 5487, 6772, 6959, 6663, 6502, 4770, 7045, 6473, 7714, 8588, 7920, 7662, 9218, 7932, 11132, 7647, 9476, 8664, 8873, 10755, 8121, 8723, 9531, 6817, 10561, 9996, 10876, 8801, 8425, 7477, 9561, 8930, 7590, 7660, 9048, 4485, 4758, 6186, 5365, 5132, 3906, 6597, 6927, 6216, 5706, 4392, 3543, 6554, 6164, 5210, 4536, 6125, 4647, 5462, 6586, 7100]
550441F145m83l09J519J57o54j454J117Q0N3J136Q50R44K92L05l845J018l74K755I348
530348I662n67J558j906J649P66l76J927k133o68K99J794j111J545k954K65O67I693
512109H631J768q10j091J401r03K0l553Q68R4j732N07Q81n85jJ327k015P61q43C966
491668B669j189J682k476J232J897M71j371P53j097n96j048r21L409j18J092n45D536
473112C953M48K021p26j673K610R47p02K11Q81j842j42M80j56o75J0J239Q83K7H158
452311F320J003l03m80L813k694j086O38q81l329K300M53j090k25j915m48R05E087
433426C846J26k876J352r51M47j56m33R2Q0M41p15o18K005K137m11K39o57R21D306
412261C400O60K5n11K001R67j45j089k41j59J225j161O77J619P12R12j708K032G648
$$ y = [6145, 5662, 5353, 6872, 7029, 6375, 4921, 6038, 6118, 6171, 7307, 8157, 9101, 9393, 9698, 5853, 6871, 6497, 9252, 9348, 9662, 9095, 10653, 8747, 10396, 11162, 10786, 12713, 10580, 9912, 10211, 12005, 10894, 12439, 9485, 9750, 10417, 9693, 8631, 10399, 9589, 8498, 9899, 8996, 9016, 5463, 6331, 6425, 4693, 5200, 6081, 5496, 5495, 6822, 4807, 5568, 4725, 3966, 2669, 1480, 3162, 686, 1918, 3815, 4286, 2915, 3668, 2571, 1975, 927, 6, 3415, 3297, 4389, 3844, 4536, 3953, 4401, 6422, 5696, 4023, 6633, 7580, 6878, 7089, 7970, 6128, 5986, 6466, 6310, 5635, 5645, 6884, 7767, 7794, 8158, 6320, 7323, 7020, 6540, 10353, 7659, 6573, 7211, 6330, 3001, 5301, 5754, 4664, 4439, 2524, 2076, 2981, 5087, 3846, 3972, 1096, 2448, 1497, 1944, 1788, 1355, 1447, 1527, 1968, 1253, 635, 2640, 4777, 4366, 4605, 3948, 4869, 4306, 3400, 4060, 4085, 3574, 5575, 6542, 6397, 5308, 5067, 4908, 6133, 4972, 5649, 7268, 7980, 8892, 7184, 9216, 7648]
391970H473j64J178J263r10j970K402j557J769r79K42L1o05j538J848L24K762A2613
372587A4632N829P271J6681K8293M1280K0992j5501l8285l2725n812J9489N4029A66461
357396A66068m9931n4845k7020n615L605n49o742j1650l251J061J1K638L335J0119C8697
339912D3975m472r799r594o470k287j238j171J379o21J594n37R70O15M206J382B2639
321196C2926K5232R7847L05268M01410J37036k84357l89902j72780O3689L15725H72205
307895H91927l66761l41102j23002k6862j1274o582l978r63k939m35r15k571j114A661
291164B198K5m54j770J978Q55L95l62q82Q08r9J384J455j587M82J407j33r73Q15D397
268672C933m06k200J721K01J42m40N4J331L53p46j538m55p69M72J477P62q72L85B130
$$ y = [8473, 8309, 9487, 10750, 9840, 7870, 10272, 8715, 10484, 9505, 9747, 9778, 9173, 7635, 9483, 9807, 12569, 12613, 14632, 20461, 27732, 44413, 72706, 113986, 134978, 119477, 81192, 48467, 42655, 62144, 116173, 166461, 166068, 116137, 61292, 34272, 28657, 32262, 31713, 24971, 13321, 10070, 11131, 11142, 13780, 17115, 27234, 38697, 43975, 39503, 29704, 20110, 13640, 11353, 10115, 8944, 10323, 9702, 11296, 10759, 11729, 12344, 16550, 17932, 22639, 32926, 58158, 156005, 461273, 862683, 999719, 715362, 325460, 152680, 216369, 532094, 872205, 891927, 525166, 184064, 61062, 34200, 22926, 16344, 12366, 11403, 8464, 8029, 7114, 4543, 3429, 1661, 2198, 2223, 1769, -1, 1977, 2832, 3227, 2865, 1983, 2791, 2692, 4076, 5531, 3944, 4426, 5833, 5700, 4727, 5542, 4397, 3933, 3527, 1327, 3048, 3249, 3391, 2951, 3005, 4336, 4689, 3943, 2405, 1950, 1181, 1653, 3130, 3892, 3020, 3405, 2130]
245969C587O81j213J922J246K50R12J365j785n31J063K107N63j089k508p74n42C455
225353D633q69J081j332pP4k30J889j617L90P93J821N958J3458J6670Q274o035D2313
204562E8453K9821L1185R970j2971j7325j9500j4048j3217j0235p028j033l135B8589
188269B3847n281n911k423l380l773o66O41j504k03P5M52j882J483j1M4J25j032A405
165984C038K286J860L821O229J1892K0240K6865K2142J0026q801j4180r564j609G1437
148249F2369j4003j4514q981R001L7904N0215L9398N00l9587m5682l8715j9927A0674
131581E415k667n7r43q4J75n50j157Q8K92p93M37Q7J062K70O51J003j517M69p23C271
106372C272M74r83J085m72N24P14N3K35P16J552M19M83J158M34J326O46N21L75A4624
$$ y = [3587, 4268, 3055, 4977, 6223, 6473, 7385, 8750, 6965, 6434, 7497, 9604, 10167, 9078, 6570, 5796, 5254, 3455, 4633, 3764, 4845, 3513, 3506, 3580, 3350, 5239, 3622, 4012, 4805, 6626, 12584, 26042, 42712, 50986, 44951, 42313, 58453, 88274, 119459, 129429, 116458, 99133, 79633, 65585, 52368, 42133, 35105, 34072, 30937, 28589, 23847, 18566, 12655, 10232, 6852, 3079, 2413, 3054, 1550, 1347, 1422, 1874, -8, 1475, 1464, 1508, 1633, 601, 1405, 3038, 5324, 7184, 11005, 17234, 29126, 49366, 76231, 98373, 108399, 99598, 85418, 75854, 74245, 71437, 62369, 48366, 33852, 24871, 33872, 71776, 121991, 161389, 161889, 122302, 76620, 37905, 17978, 10674, 5415, 2748, 2691, 1748, 1664, 1839, 1289, 132, 220, 512, -281, 156, 243, 1305, 1575, 2226, 3229, 1712, 2181, 1458, 3271, 3272, 3746, 2763, 3848, 3376, 3900, 4614, 4667, 4902, 5618, 7170, 7589, 8072, 9230, 9664, 10990, 11636, 12157, 12532, 14624]
82127A6379J542K262L636L302K061M10j334j66L34J81K777C2748
$$ y = [16379, 17921, 20183, 23819, 27121, 29182, 29592, 28258, 28092, 28426, 28607, 31384, 32748]
66244C7049  $$checkpoint
##END=