##TITLE= Raman spectrum of Synthetic Witherite � http://rdrs.uaic.ro
##MINERAL= Synthetic Witherite
##CHEMISTRY= BaCO3
##JCAMP-DX= 5.01
##DATA TYPE= RAMAN SPECTRUM
##DATA CLASS= XYDATA
##ORIGIN= Department of Geology, UAIC, Romania
##OWNER= http://rdrs.uaic.ro � stud. Apopei Andrei Ionut
##LONGDATE= 2009/10/18 23:09:35.0154 +0300 $$ export date from JSpecView
##XUNITS= Raman shift (1/cm)
##YUNITS= Intensity (cnt)
##XFACTOR= 3.188736E-3
##YFACTOR= 1.32419331E-3
##FIRSTX= 3399.97
##FIRSTY= 7.75632055
##LASTX= 211.234
##NPOINTS= 1024
##XYDATA= (X++(Y..Y))
1066244 5857 6779 7165 7367 8200 8065 7925 7579 6828 5853 5563 4821 4766 4287 3523 4033 3633 2604 2329 2017 1744
1049952 1235 1428 1371 1414 1535 1689 2459 1053 1170 63 734 608 1387 1402 1625 1097 999 770 874 1559 874 635
1032726 291 -181 627 913 1038 1300 1949 1859 1029 284 105 -52 193 861 311 451 902 159 -212 186 1292 1561
1015333 1633 1527 867 641 1039 532 86 827 256 724 1312 1044 932 969 1213 576 439 991 1003 1125 2058 1795
997778 2415 2705 2235 1337 792 1340 2107 2302 3322 2495 3304 1931 3730 3839 3834 4357 3999 4871 4504 4944 4572
980862 3969 4217 3542 5227 5109 5597 5538 5624 6229 5233 5749 5228 5507 5788 6142 6050 6056 5862 6103 5352 5441 5741 6001
962159 6615 6780 6513 6923 7400 7717 7911 8182 7570 8025 7778 7255 7768 7538 7299 7499 8148 8431 8201 8243 7939
944920 7589 8635 9924 9237 9450 9151 9812 10483 10088 10509 9988 10063 9735 9962 10218 10257 9429 9359 10151 10155 9814 10801
926687 11578 11153 11234 12080 12385 11213 12099 11498 11462 10516 10550 10659 11754 11050 10693 10767 11532 11579 12104 12043 11751 11912
908282 11614 12676 12456 13532 13640 12782 12003 11042 10311 9588 8713 8636 10072 12490 14555 14335 14129 13719 13156
892241 13990 13578 13767 14090 13855 13583 14204 14056 13775 13173 13109 12972 13602 13269 13260 12968 13854 14188 14828 14768 14353 13790
873500 13618 13181 13400 13706 13953 13820 13914 13721 13885 13648 13305 14081 12583 11902 11443 11264 11839 12923 13138 13333
856308 12770 12716 12909 12349 12143 11561 11505 12187 11241 11514 11802 11248 11984 12694 11629 11950 12471 12340 11224 11131 11369
838091 11418 11007 10651 11279 11231 11989 11095 11382 11062 10488 9428 9063 9950 9411 10455 9304 9369 9483 9506 9825 9669
819704 9378 8713 8823 7802 7945 8124 9098 8753 7407 6726 6852 7038 6952 6550 7043 5556 5005 5310 6073 7079
802036 7248 6432 5949 6665 6186 7087 7051 6659 6732 6878 5900 5548 5611 5363 4754 4734 4481 5463 3999 2795 2896 3427
782420 5987 5242 5524 4624 4509 4590 4670 5000 4567 4315 3866 3677 3810 4192 5277 5236 6082 6058 5999 6741 6088 6379
762609 5140 4801 4316 3080 4075 3373 2325 1472 -24 1968 2080 3329 2530 2666 3158 1973 2076 2020 1633
745345 2113 2133 2444 2143 2498 1959 1944 2183 1979 1877 1585 1354 2388 2932 2615 3619 4070 2969 3101 2487 3222
726093 3211 1554 1083 1066 2740 1435 1773 2397 1552 2005 956 1250 1654 1506 1573 1812 1199 880 779 1262
707591 662 23 608 473 -99 58 787 1222 1346 60 207 293 812 912 1020 286 545 901 366 601 593
687984 -13 20 406 478 715 1162 367 523 661 410 405 1064 1024 -14 202 1094 1205 1281 737 915 1371 1317 1341 1441
665348 1431 2641 3574 3177 2653 2104 2609 2241 2447 1968 2280 1078 2052 1005 2354 2359 2217 1951 678 207
646300 1093 1168 3431 2427 2403 1373 1829 606 1286 2601 3283 2621 2997 3034 2263 1630 1221 963 2293 2453
627079 2246 2348 2203 1823 834 -125 1114 110 768 1071 178 -1 994 2387 3621 4259 3611 3436 3616 3769
607686 2820 2927 3082 3674 4736 4752 3447 2612 2201 3663 3322 3439 2985 3225 4384 3985 3808 4330 4774 5071
588114 4707 4707 4950 5559 6306 5952 5094 4455 4482 4364 3860 3107 1639 1443 3324 4657 3427 1662 1350 903
568366 3243 4411 5480 5788 6365 5636 6622 6616 7627 8252 8068 9025 9965 12093 12817 12858 13008 12408 12499 12534 11852
547439 12065 11440 10482 10192 10271 10805 9872 10200 10978 12226 12111 11975 10522 10013 9627 10586 10894 10533 10527 11657 10746
526309 11219 10895 11137 10974 10779 11279 10479 10682 10602 10388 10623 10813 10137 10604 10535 10421 10524 10062 10128 10151 10875 10250
503955 10709 9757 9671 9196 9268 8393 9545 8594 7752 7776 7933 7426 8163 8333 8571 8115 9183 9172 8939 8536 8855
482407 9456 9248 8733 9967 10933 13822 18288 26018 34479 37047 33215 24903 18336 15548 12493 11041 9998
464814 9019 8446 7509 8036 7592 7322 7583 7730 7125 7142 6978 7111 7248 7903 9229 10360 17581 37517 52787 48337
443938 28381 13434 10279 9373 8886 8366 8995 8877 9214 8279 7980 7195 7582 7453 6841 6991 6654 7050 6928 6609
422867 5878 5173 6545 5978 5568 5803 5638 5515 5907 4776 5138 5347 4518 5371 5953 5705 4545 4058 3732 4128
401604 4354 3270 4388 5115 5670 6063 5029 4992 5189 5897 5701 6451 6010 5780 5915 5736 5756 5056 4516 4723 5138
379066 5639 5007 4558 5721 5170 4699 4925 5410 4913 5213 5070 5430 5695 5399 5529 5232 4775 5680 4284 5600
357396 5709 5108 5412 5347 3588 3644 4259 4892 4215 4579 4628 5648 4954 4897 5042 5636 7550 7667 9335 14183 85738
334424 446287 898735 999297 581664 152566 25550 13902 12799 11240 7980 5240 4366 4357
320092 3600 2897 2887 2994 3071 2528 2367 2744 1290 38 705 1332 1444 1871 1533 1043 1783 1412 416 985 369
296754 318 172 -177 113 1507 1006 1203 326 581 498 1018 1059 21 7 533 1902 1872 1764 1864 2760 2372 2339
272059 2234 2179 2401 2011 1946 2161 1020 2637 1248 943 446 1390 2413 2161 2122 1314 2182 2871 1580 2324
249388 3097 3523 4378 4039 3422 3484 3000 3877 4037 3730 2845 2584 2719 3672 3607 4429 3481 2271 3296 4346 4757
225353 4443 4988 8829 18585 43290 92480 143661 169987 138789 76023 31239 10129 5126 4347 3658
208040 2743 3665 4734 5891 6885 7657 7612 6347 5043 5980 5547 5316 4157 5185 5764 5498 4242 3815 6146
185933 5166 6210 7745 7624 7245 7198 7643 6822 8179 8016 6212 5828 4164 4556 3785 3890 8035 7202 5511
163627 5196 4087 3374 0 3352 2817 3442 4983 4753 3887 7974 7632 4567 2929 1129 4529 7146 6662
142309 7817 6793 6826 7603 6093 4555 4776 4327 3537 5685 8451 8789 7654 3917 -703 -384 1014 4185
120808 9890 12769 11906 10801 9881 9814 8495 10019 5935 6552 7986 6135 3435 249 -556 -160 2799 7023
99123 12855 16576 20601 32247 46955 55712 60792 60480 69325 55667 43525 33783 29940 24765 16142
80909 19136 15451 25041 33036 44915 54114 75337 112913 145133 156518 145507 106581
66244G5333  $$checkpoint
##END=