##TITLE= Raman spectrum of Szmikite � http://rdrs.uaic.ro
##MINERAL= Szmikite
##CHEMISTRY= MnSO4*(H2O) 
##JCAMP-DX= 5.01
##DATA TYPE= RAMAN SPECTRUM
##DATA CLASS= XYDATA
##ORIGIN= Department of Geology, UAIC, Romania
##OWNER= http://rdrs.uaic.ro � stud. Apopei Andrei Ionut
##LONGDATE= 2009/11/08 20:32:54.0831 +0200 $$ export date from JSpecView
##XUNITS= Raman shift (1/cm)
##YUNITS= Intensity (cnt)
##XFACTOR= 3.188736E-3
##YFACTOR= 8.0646871E-4
##FIRSTX= 3399.97
##FIRSTY= -6.91556401
##LASTX= 211.234
##NPOINTS= 1024
##XYDATA= (X++(Y..Y))
$$ plain form
1066244 -8575 7524 4993 4004 2612 3798 2236 444 -819 523 310 -2562 -2206 -5383 -2625 -4236 -1564
1053066 -1978 1346 3332 2768 2607 -564 -2674 -1991 -2274 -6004 -6214 -5196 -5303 -6261 -5589 -1755 -455 -848
1039007 -2845 -106 -340 4180 4772 4350 -197 -4768 -3898 -110 -725 1283 -1572 -459 6250 431 2263 4630
1024839 1624 -2480 2353 3163 -860 -2583 3866 -2429 -2394 -4042 3911 8011 7807 4905 -1444 -3121 -1220
1011360 -831 -2420 -4281 -1013 1105 2409 842 -419 2956 -760 39 -1954 -2979 4179 1834 4711 5714
997778 7459 2081 4095 30 2238 2445 5750 3724 9960 4135 2494 5174 6296 3270 3807 1273 2856
984095 3147 3422 4360 -3373 -3392 -3468 -3752 -5117 -19 2387 2794 5190 6461 9405 6562 3542 516 2056
969500 1719 65 -228 1342 3009 986 2767 -255 -1770 -4102 -4919 -2634 -1672 4766 2342 3912 -1882
$$ packed form
1066244h575J6099k531r89j392J186j562j792j263J342k13k872L56l177K758j611a564
1053066a978L324J986n64j61l171k110O83k83l730k10J018j07r58O72L834J300h48
1039007b845K739k34M520N92m22m547m571Q70L788o15K008k855J113O709n819J832D630
1024839A624m104M833Q10m023j723O449o295L5j648P953M100k04k902o349j677a220
1011360h31j589j861L268K118J304j567j261L375l716P99j993j025P158k345K877E714
997778G459n378K014m065K208K07L305k026O236n825j641K680J122l026N37k534B856
984095C147K75R38p733j9p6k84j365N098K406M07K396J271K944k843l020l026B056
969500A719j654k93J570J667k023J781l022j515k332q17K285R62O438k424J570a882
$$ plain form
955611 -7838 -5884 -4120 -4816 -5714 -4050 -4483 -2546 1423 1110 -3457 -3827 -4383 -7302 1887 5003 6772 7963
940790 2725 9637 6521 617 575 -3538 -4014 4727 2414 1705 1590 -1998 -4206 -6008 -5001 567 -323 -2025
925856 1991 1331 4582 2500 2521 -2630 -1031 -899 -1822 -1676 -2459 -2198 1568 4709 2226 2769 1262 -160 1374
909962 4438 21 1644 3483 5266 6742 7504 3644 2861 2725 -1638 -187 -2070 -87 1165 4451 10297
895628 8534 9226 4891 2169 6323 5870 6482 9849 6944 8889 9622 4419 3660 -118 -1973 941 3619 9132
880336 7673 7395 8485 9143 7476 7650 7808 4975 4426 278 -1419 -797 -2252 -2704 912 2126 2975 2762
864923 2961 630 306 -2656 -3576 -7336 -4840 -4662 3056 5164 1822 246 3609 -418 1135 150 -984
850252 -5810 -3445 1182 2747 3043 1579 -690 2955 -2891 -2557 -5894 -5364 -5135 -5628 -6949 -2776 -1516 176
$$ packed form
955611g838J954J764o96q98J664m33J937L969l13m567l70n56k919R189L116J769G963
940790B725O912l116n904m2m113m76Q741k313p09j15l588k208j802J007N568q90b025
925856A991o60L251k082K1n151J599J32r23J46p83K61L766L141k483N43j507j422A374
909962D438m417J623J839J783J476P62l860p83j36m363J451j883J983J252L286A0297
895628H534O92m335k722M154m53O12L367k905J945P33n203p59l778j855K914K678I132
880336G673k78J090O58j667J74J58k833n49m148j697O22j455m52L616J214Q49B762
864923B961k331l24k962r20l760K496J78P718K108l342j576L363m027J553r85i84
850252e810K365M627J565K96j464k269L645n846L34l337N30K29m93j321M173J260A76
$$ plain form
834600 72 -163 1396 -2293 -686 -2147 -4737 -4786 238 941 5252 2032 1672 3317 678 6018 3340 9011
818826 4530 3519 -2103 -739 -718 4719 5588 3447 2456 465 3728 3461 -2458 -1241 -818 8518 3080 2467
802923 5734 7378 3833 5211 5294 7197 7761 10190 9156 6370 6074 1291 -1688 3939 6062 5824 2361 -3389
786895 1020 3628 -2630 3986 4481 3526 2732 5184 4784 2642 2034 5468 6455 9281 1024 1927 669 -48
770738 2862 9375 10593 16331 12425 5912 5402 5105 7712 1389 5057 31 -281 -2165 1035 4126 339
755359 -3936 -1484 -4079 -4031 -339 1068 1140 -239 1022 -1860 -3351 -7125 -7295 -3966 149 5789 4763 3538
738948 616 -719 -3588 -4027 -2757 720 3476 714 3680 10884 6685 6471 -186 3327 714 3110 3773
723330 987 2502 -985 -401 -4530 -2262 3233 -156 -727 -2061 964 3019 -528 -2801 347 -707 657
$$ packed form
834600G2k35J559l689J607j461k590m9N024P03M311l220l60J645k639N340k678I011
818826D530j011n622J364K1N437Q69k141r91j991L263k67n919J217M23R336n438B467
802923E734J644l545J378Q3J903N64K429j034k786k96m783k979N627K123k38l463c389
786895A020K608o258O616M95r55p94K452m00k142o08L434R87K826q257R03j258d8
770738B862O513J218N738l906o513n10k97K607o323L668n026l12j884L200L091C39
755359c936K452k595M8L692J407P2j379J261k882j491l774j70L329M115N640j026C538
738948F16j335k869m39J270L477K756k762K966P204m199k14o657L513k613K396C773
723330I87J515l487N84m129K268N495l389n71j334L025K055l547k273L148j054F57
$$ plain form
707591 987 -4266 -1419 -2234 -3573 -4061 106 169 1615 -1058 -734 -2287 -6174 -6241 -5425 684 1991 -2724 712
689860 -1634 -411 -1725 -5336 -4058 -2328 -2452 1182 -4052 1167 1465 1627 509 598 -4383 -1527 -3221 -194
672922 -179 165 610 -2110 4077 8850 6860 3012 600 6820 9376 12493 11238 5858 7301 -503 4483
656799 4967 2311 1351 3007 5067 4763 7507 5201 4068 940 -1543 -2743 2730 7951 1748 2182 455
640552 192 -537 -1183 4252 2218 674 3109 847 -850 -2651 -4436 -6046 -2867 -1802 -5206 -5800 546
624181 -243 -4062 -8801 -6161 -4213 -5429 -3666 -2621 -2424 -3596 -3536 -3506 -2039 -3367 -2571 2355 3468 2134
606711 -418 853 2672 1479 550 156 2825 3611 -890 -5 5050 6616 5532 3641 1881 -2501 -224 2936
589099 -536 -731 1188 2597 5654 399 -307 -1533 -3444 -1395 -3124 -3387 -5213 -5899 -9882 -7765 -2 -1740
$$ packed form
707591I87n253K847q15j339m88M167O3J446k673L24j553l887o7Q16O109J307m715G12
689860a634J223j314l611J278J730j24L634n234N219K98J62j118Q9m981K856j694a94
672922a79L44M45k720O187M773j990l848k412O220K556L117j255n380J443p804D483
656799D967k656r60J656K060l04K744k306j133l128k483j200N473N221o203M34D55
640552A92p29o46N435k034j544K435k262j697j801j785j610L179J065l404n94E46
624181b43l819m739K640J948j216J763J045J97j172O0L0J467j328P96M926J113B134
606711d18J271J819j193r29l94K669P86m501Q85N055J566j084j891j760m382K277B936
589099e36j95J919J409L057n255p06j226j911K049j729k63j826o86l983K117P763a740
$$ plain form
571342 -7406 -9138 -7107 -4046 -2174 -2607 -6487 -2882 -4302 -8406 -3621 1864 2764 5696 3734 619 -139
554436 -1954 -72 2385 1928 924 1951 1760 -156 4390 2536 1252 2793 2631 -3898 -3743 -1523 -5071
537401 -2273 -1860 -1517 1185 79 4856 3288 2196 3017 5814 2893 3518 7746 3753 5257 6216 4540 3709
519221 4235 5578 5017 5874 9996 7960 7663 7738 5915 -1803 4235 3965 6278 8631 6336 9582 7169 5890
500891 4124 4839 4453 7329 5002 2427 4316 4392 761 5480 3391 6367 6802 9802 6546 1788 -314 6029
482407 6591 4308 3480 -61 2910 302 -2958 -6023 -4855 -3289 782 -952 -1941 402 3760 2734 5018
464814 4848 5173 6040 3377 1165 2747 1910 -4287 -5561 -2670 -3148 -2772 -5540 -3219 -3511 3113 1746 1863
446033 -3910 -7216 -5867 -10344 -4810 -3102 -1537 -1029 -1116 -1146 1540 2256 -685 -2160 -2944 -2770 -3402 -1705 -1490
$$ packed form
571342g406j732K031L061J872m33l880L605j420m104M785N485R00K932j962l115a39
554436a954J882K457m57j004J027j91j916M546j854j284J541j62o529J55K220e071
537401b273M13L43K702j106M777j568j092Q21K797k921O25M228l993J504R59j676C709
519221D235J343n61Q57M122k036k97P5j823p718O038k70K313K353k295L246k413E890
500891D124P15l86K876k327k575J889P6l631M719k089K976M35L000l256m758k102F029
482407F591k283q28l541K971k608l260l065J168J566M071j734r89K343L358j026E018
464814D848L25Q67k663k212J582q37o197j274K891m78L76k768K321k92O624j367A863
446033c910l306J349m477N534J708J565N08q7l0K686P16k941j475p84J74o32J697a490
$$ plain form
426040 282 2202 2007 -2117 436 1930 2678 5393 4657 3048 4413 1518 7028 7538 5097 6341 6734 9552
406939 9380 6015 6811 4636 6760 8143 4855 4542 7915 9249 12184 8047 7539 9355 9619 8057 9195
388753 8955 3966 1766 5809 4703 3517 2694 3860 1657 2925 4269 7866 18158 43229 78238 99139
371505 86018 50904 20624 8075 4176 6544 3223 2272 -2335 -3804 -4543 -4935 -7454 -7089 -6293 -2615 -6310
353036 -7901 -5249 -2022 1437 3762 11552 28154 59424 105261 154062 178829 178196 154349 117429 80471
336622 45128 20496 5247 -947 -2874 1540 4849 5209 13094 23687 46213 104414 242393 528814 859686
320092 989656 792796 454532 213841 102152 54879 33277 19372 7448 4241 877 -2821 -4373
305671 -6543 -4799 -3915 -706 -199 435 -139 -2676 -2924 -2597 116 1182 2631 7900 2357 2316 506 461
$$ packed form
426040B82J920j95m124K553J494P48K715p36j609J365k895N510N10k441J244L93I552
406939I380l365P96k175K124J383l288l13L373J334K935m137n08J816K64j562I195
388753H955m989k200M043j106j186q23J166k203J268J344L597J0292K5071L5009I9139
371505H6018l5114l0280j2549l899K368l321r51m607j469p39l92k519L65P96L678f310
353036g901K652L227L459K325P790J6602L1270M5837M8801K4767o33k3847l6920H0471
336622D5128k4632j5249o194j927M414L309L60P885J0593K2526N8201J37979K86421H59686
320092I89656j96860l38264k40691j11689m7273k1602j3905j1924l207l364l698d373
305671f543J744Q84L209N07O34n74k537k48L27K713J066J449N269n543m1j810D61
$$ plain form
285560 3313 2511 1500 1090 -669 2031 -850 2179 -192 2603 3108 2414 983 606 726 177 2577 2645
265280 2007 5262 2548 1674 -4095 -1538 -171 -1773 -975 -2372 -3814 -2689 -3057 -720 -5545 -4550 -1386
245969 1471 1923 14 2317 2940 -1222 -496 901 361 603 704 -1675 -1572 316 57 1000 127 8 -483
224203 -686 -3366 -6124 -2708 1570 -953 2273 806 1057 3662 3885 7129 8178 15901 27819 45570 61983
204562 62985 52302 40649 37508 44452 66582 98448 128017 133218 119475 84898 51066 27115 17137
188269 10054 8527 9482 8684 7689 6202 1369 1993 151 95 285 928 -1091 -120 -1170 -1270 -2553 -3511 -1373
165984 2184 4115 7400 12146 18968 33795 52722 76819 108882 131077 134777 122204 96532 68737 47493
148249 27995 15048 13656 13135 10813 9785 10892 11193 12981 23833 48327 78435 98379 95621 75487
$$ packed form
285560C313q02j011m10j759K700k881L029k371K795N05o94j431l77J20n49K400B645
265280B007L255k714q74n769K557J367j602P98j397j442J125l68K337m825R95a386
245969A471M52j909K303O23m162P26J397n40K42J01k379J03J888k59R43q73j19d83
224203f86k680k758L416M278k523L226j467K51K605K23L244J049P723J1918J7751F1983
204562F2985j0683j1653l141O944K2130L1866K9569N201j3743l4577l3832k3951A7137
188269A0054j527R55p98r95j487m833O24j842n6J90O43k019R71j050j00j283r58a373
165984B184J931L285M746O822J4827J8927K4097L2063K2195L700j2573k5672k7795D7493
148249B7995j2947j392n21k322j028J107L01J788J0852K4494L0108J9944k758G5487
$$ plain form
130386 45647 24583 12573 5608 3723 1531 -1924 -2260 -763 -691 -494 -2496 355 -2413 -1104 610 -2214
109989 -3729 -1150 175 -3390 -3315 -2957 -904 -791 -240 607 2735 5909 7948 15350 21180 22563 24892 29844
88210 28984 30212 40074 51321 60228 60464 55061 43052 36603 28669 26309 24513 22817 26925 31750 40603
68694 51420 56190
$$ packed form
130386D5647k1064j2010o965j885k192l455l36J497P2J97k002K851k768J309J714b214
109989c729K579J325l565P5L58K053J13N51Q47K128L174K039P402N830J383K329B9844
88210B8984J228R862J1247Q907K36n403j2009o449p934k360j796j696M108M825D0603
68694E1420E6190
66244F0808  $$checkpoint
##END=