##TITLE= Raman spectrum of Witherite � http://rdrs.uaic.ro
##MINERAL= Witherite
##CHEMISTRY= BaCO3
##JCAMP-DX= 5.01
##DATA TYPE= RAMAN SPECTRUM
##DATA CLASS= XYDATA
##ORIGIN= Department of Geology, UAIC, Romania
##OWNER= http://rdrs.uaic.ro � stud. Apopei Andrei Ionut
##LONGDATE= 2009/10/18 23:23:10.0256 +0300 $$ export date from JSpecView
##XUNITS= Raman shift (1/cm)
##YUNITS= Intensity (cnt)
##XFACTOR= 3.188736E-3
##YFACTOR= 2.96979258E-3
##FIRSTX= 3399.97
##FIRSTY= 2.29321647
##LASTX= 211.234
##NPOINTS= 1024
##XYDATA= (X++(Y..Y))
1066244 772 2591 1659 2855 3101 2251 2762 2158 2035 1713 1807 2202 1808 693 1961 1581 2032 1383 1134 1297
1050730 428 445 1537 1573 1417 -14 137 688 1001 30 1218 164 721 1159 771 650 1036 477 -29 457 823
1034297 1388 1805 1910 713 1090 2203 1219 1674 2087 1865 1255 507 1221 1264 1455 1822 2041 1147 908 1773 32
1017717 767 1763 2179 2618 2471 2084 1391 1257 1456 1759 1928 1597 1628 1442 1686 2374 1182 1484 1841 1747 1157 1013
1000183 -22 1004 1832 953 2798 2789 616 576 623 1449 1807 860 829 1200 966 914 2188 1156 1890 1972 1711 1019
982480 1496 1437 1009 541 1169 1626 1867 3288 2850 2654 2747 1416 1728 1526 1305 2158 1474 1958 1464 890 1130
965426 889 1709 917 1654 2372 1908 2127 1688 1973 2221 2731 2541 2424 1467 1156 813 1210 1480 1672 2208 2185
948216 2860 1932 1387 1437 1640 2624 1440 2515 3192 3343 1895 2598 2146 2410 2104 2101 2113 2694 3332 1745 2551
930845 1755 1747 1917 1442 3014 2585 3697 3085 3024 2774 3811 3188 2502 2506 3459 2068 2286 3114 2828 2199 1847
913318 3086 3307 2450 2882 2357 2131 2518 2485 3080 2762 3494 2121 2897 3015 2272 2022 1555 1374 2360 3214 3415
895628 3309 3633 3639 4821 5111 4211 3370 3864 3679 2781 4753 4403 2906 3559 3161 3952 3699 3106 4481 4110
878630 4323 4606 5297 4315 3761 3093 3736 4860 4202 4260 4675 4239 4840 2977 2960 5367 5916 4848 3345 3323
861482 3707 3543 4200 5076 4557 4652 3658 4409 5171 4392 3770 4101 4168 3622 3861 2862 4057 3752 4337 4122 4773
843312 4032 4514 3726 4829 3989 4402 3840 4197 3324 3641 3583 5020 4366 4318 3109 3510 1965 2343 3204 3075
825851 3505 3336 3831 2804 4603 3882 4195 3654 3368 3491 3161 2360 2527 1990 2445 2761 1819 1150 2416 1761
808239 2958 2519 1179 1763 1215 2740 1638 2152 984 3043 2766 2993 3475 2775 3995 3076 2457 1337 2529
791357 2238 3218 2045 1105 1436 3129 1544 14 769 838 1601 1488 1893 2701 1793 2356 1697 1797 1310 1083
773438 1249 285 982 1898 2175 2526 3224 3951 5292 6418 4906 4331 3911 3713 3245 2629 2494 2214 1847 943
755359 1679 1893 2801 2114 2899 3443 2528 2569 3206 2632 1313 2637 2524 3028 3879 3416 1965 2705 4087 3043
737117 2776 2977 2390 3815 3146 3863 3056 3943 4491 2396 3336 2487 3490 2828 4248 3737 3052 2210 3636 3518
718711 3390 3865 4278 3688 2394 3397 3042 3451 3349 3171 3363 3767 2631 4183 2968 3341 3577 3649 2695 3057
700143 2817 3647 2554 2345 2392 1436 2109 2855 2671 1966 3339 3642 1822 2204 1181 1575 1772 2069 3031 1635
681408 2485 1971 2004 2835 3279 2292 2552 1895 2959 3633 3785 2252 2990 4251 3844 2952 2613 3230 5371 5427
662504 5102 5010 4602 3935 3838 3640 2954 3695 2901 3538 3960 3675 4048 2950 2667 2082 1027 1874 2168 2914 2190
642471 1818 1975 1564 2055 681 3046 2346 1460 2798 2231 1880 1931 447 733 2729 772 820 226 1549 1113
623216 -59 700 1289 -71 1 205 51 782 1068 1742 1796 2139 2793 1999 3019 3161 1193 1168 1632 2160 2633 1464
601834 3082 1352 1755 2232 1395 2081 2896 2112 4256 2645 2897 3127 3080 2460 2638 2655 3921 2446 3444 3452
582209 4279 2836 2818 3117 2476 1991 1705 820 955 2901 2737 614 90 778 1519 2062 1314 2465 2893 3242
562408 2427 2229 3251 3865 4344 4663 6976 8486 8876 8565 9460 8781 7611 8014 7670 6720 7336 6387 6676 5289
542425 5878 5833 6112 6892 8063 7837 6048 5417 4575 5142 5068 4321 3963 4531 4710 5308 5177 4952 4606 5053 4551
521247 4790 4296 5785 4978 4952 4266 5157 4099 5268 4203 4018 4192 4179 4368 3356 5100 4070 3810 3781
501914 3471 4095 2928 3389 3101 3201 2337 2708 2983 2241 2443 2669 3470 3283 2888 3512 3099 2354 4044 3474
481379 2510 1945 3204 4818 6333 9510 14504 19305 19138 15915 10886 7178 6475 4899 5430 4091 3435
463773 4419 3730 2585 3941 3340 3714 3580 2942 3871 3796 3991 3109 3059 3622 4656 10257 23673 34808 32122
443938 16774 6536 5412 4957 3698 4334 3068 2941 3222 4949 3865 2924 1712 1153 2299 1795 2134 2075
424983 -24 1256 923 1612 1067 1916 2013 1807 2605 1738 2122 1781 1906 1622 2729 2540 2763 2399 3100 2246 1997
402671 2092 2054 2098 2498 3107 2696 3341 2094 3655 2901 3230 2567 2185 3094 2719 2759 2814 2664 1780 2429 3272 1898
379066 1740 2666 2354 2728 2510 1664 1297 2480 1674 3102 2025 1857 2952 2451 1881 1077 1237 1228 1789 2393
357396 1610 863 1364 956 1005 -20 2053 1721 1605 1050 3148 1658 1891 2850 2696 3585 4036 4903 6675 10284
335522 88397 487144 948418 999896 537655 111393 17879 10626 10221 8911 6779 3399 2486 2464
320092 769 1021 779 858 1007 1495 574 657 133 -102 733 720 514 202 1222 885 1025 677 317 523 463 1012
295637 368 81 119 395 1174 690 1152 1044 1535 2300 1689 939 -63 1279 1574 1098 2024 1661 1383 2200 2604
272059 2173 2658 2392 2023 2355 2180 1779 1524 2138 2176 804 2113 1413 1799 691 949 240 1528 1976 1078
249388 2261 1714 1835 1540 1282 1335 1246 1920 1919 2433 1874 2645 1828 1748 1165 1883 1180 1759 1240 1591 1755 2471 2450
223052 4350 10901 27910 62003 98466 113075 87264 43977 15561 4215 2188 1505 1965 1506 1001
205722 1335 1775 1928 2078 1673 2277 1570 1726 1612 2539 1157 2278 2488 1768 1033 2019 1936 1820 2406 1292 594
181253 550 1536 727 1390 871 801 53 423 497 248 324 -104 258 1281 856 826 438 -80 223 108 336 977
155358 1699 2480 3652 3839 3169 1941 1072 1155 681 1299 1920 1911 1738 1303 685 1474 1219 1990 2495 1996 2228
130386 2457 1832 2481 1783 2254 1824 2879 2332 2103 2429 2350 2666 1817 2457 3014 2731 2061 2096 2028 1760 1305 868
103957 1140 761 448 470 39 583 334 571 737 819 -30 941 368 973 676 1560 1619 1509 2716 2914 4138 6703
77250 11129 17393 31482 49458 69524 78531 74907 59046 40591
66244B4771  $$checkpoint
##END=